Torna indietro   Hardware Upgrade Forum > Software > Linux, Unix, OS alternativi

WoW Forever: la beta è stato uno dei momenti più alti della storia dei videogiochi, e non si ripeterà
WoW Forever: la beta è stato uno dei momenti più alti della storia dei videogiochi, e non si ripeterà
Un mondo affollato e vivo, personaggi destinati a sparire a fine test e nessuno a inseguire l'oggetto giusto. Beta e stress test di World of Warcraft: Forever hanno fatto emergere un roleplay spontaneo, tra danze a Goldshire e code ordinate ai PNG
Oracle AI World 2026: in Europa prima la sovranità, poi la sicurezza e solo dopo l'IA
Oracle AI World 2026: in Europa prima la sovranità, poi la sicurezza e solo dopo l'IA
In tre giorni a Las Vegas Oracle ha presentato agenti che eseguono il lavoro, l'alleanza con OpenAI e un cloud aperto agli acceleratori di tutti. Ma i clienti europei chiedono garanzie prima ancora delle funzionalità
DS N°7 E-Tense: il SUV premium made in Melfi che punta su autonomia e comfort
DS N°7 E-Tense: il SUV premium made in Melfi che punta su autonomia e comfort
Fino a 740 km WLTP con la batteria da 97,2 kWh, sospensioni che leggono la strada con una telecamera e un abitacolo da salotto parigino. La nuova DS N°7 raccoglie l'eredità della DS 7 e la porta, per la prima volta, nel mondo 100% elettrico. Ecco come è fatta, cosa offre e quanto costa.
Tutti gli articoli Tutte le news

Vai al Forum
Rispondi
 
Strumenti
Old 31-05-2004, 11:42   #1
qaywsx
Senior Member
 
L'Avatar di qaywsx
 
Iscritto dal: Jan 2004
Messaggi: 426
kxdocker

Durante la compilazione di kxdocker 0.17 ricevo un errore durante il make;
-----------------------------------------------------
make all-recursive
make[1]: Entering directory `/home/*****/Documents/temp/kxdocker-0.17'
Making all in doc
make[2]: Entering directory `/home/*****/Documents/temp/kxdocker-0.17/doc'
Making all in .
make[3]: Entering directory `/home/*****/Documents/temp/kxdocker-0.17/doc'
make[3]: Nothing to be done for `all-am'.
make[3]: Leaving directory `/home/*****Documents/temp/kxdocker-0.17/doc'
Making all in en
make[3]: Entering directory `/home/raffa/Documents/temp/kxdocker-0.17/doc/en'
/opt/kde3/bin/meinproc --check --cache index.cache.bz2 ./index.docbook
make[3]: Leaving directory `/home/*****/Documents/temp/kxdocker-0.17/doc/en'
make[2]: Leaving directory `/home/******/Documents/temp/kxdocker-0.17/doc'
Making all in po
make[2]: Entering directory `/home/*****/Documents/temp/kxdocker-0.17/po'
make[2]: Nothing to be done for `all'.
make[2]: Leaving directory `/home/******/Documents/temp/kxdocker-0.17/po'
Making all in src
make[2]: Entering directory `/home/******/Documents/temp/kxdocker-0.17/src'
if g++ -DHAVE_CONFIG_H -I. -I. -I.. -I/opt/kde3/include -I/usr/lib/qt3/include -I/usr/X11R6/include -DQT_THREAD_SUPPORT -D_REENTRANT -Wnon-virtual-dtor -Wno-long-long -Wundef -Wall -pedantic -W -Wpointer-arith -Wwrite-strings -ansi -D_XOPEN_SOURCE=500 -D_BSD_SOURCE -Wcast-align -Wconversion -Wchar-subscripts -O2 -Wformat-security -Wmissing-format-attribute -fno-exceptions -fno-check-new -fno-common -MT main.o -MD -MP -MF ".deps/main.Tpo" \
-c -o main.o `test -f 'main.cpp' || echo './'`main.cpp; \
then mv -f ".deps/main.Tpo" ".deps/main.Po"; \
else rm -f ".deps/main.Tpo"; exit 1; \
fi
/usr/lib/qt3/bin/moc ./kxdocker.h -o kxdocker.moc
if g++ -DHAVE_CONFIG_H -I. -I. -I.. -I/opt/kde3/include -I/usr/lib/qt3/include -I/usr/X11R6/include -DQT_THREAD_SUPPORT -D_REENTRANT -Wnon-virtual-dtor -Wno-long-long -Wundef -Wall -pedantic -W -Wpointer-arith -Wwrite-strings -ansi -D_XOPEN_SOURCE=500 -D_BSD_SOURCE -Wcast-align -Wconversion -Wchar-subscripts -O2 -Wformat-security -Wmissing-format-attribute -fno-exceptions -fno-check-new -fno-common -MT kxdocker.o -MD -MP -MF ".deps/kxdocker.Tpo" \
-c -o kxdocker.o `test -f 'kxdocker.cpp' || echo './'`kxdocker.cpp; \
then mv -f ".deps/kxdocker.Tpo" ".deps/kxdocker.Po"; \
else rm -f ".deps/kxdocker.Tpo"; exit 1; \
fi
In file included from xeplugin_taskmanager.h:26,
from kxdocker.cpp:25:
taskmanager.h:217: error: parse error before `&' token
taskmanager.h:379: error: syntax error before `;' token
taskmanager.h:51: warning: ISO C++ forbids declaration of `Task' with no type
taskmanager.h: In member function `QString Task::visibleIconicName() const':
taskmanager.h:88: error: `_info' undeclared (first use this function)
taskmanager.h:88: error: (Each undeclared identifier is reported only once for
each function it appears in.)
taskmanager.h: In member function `QValueList<WId> Task::transients() const':
taskmanager.h:102: error: `_transients' undeclared (first use this function)
taskmanager.h: In member function `double Task::thumbnailSize() const':
taskmanager.h:232: error: `_thumbSize' undeclared (first use this function)
taskmanager.h: In member function `bool Task::hasThumbnail() const':
taskmanager.h:245: error: `_thumb' undeclared (first use this function)
In file included from kxdocker.cpp:31:
xeplugin_gepager.h: At global scope:
xeplugin_gepager.h:56: error: syntax error before `*' token
xeplugin_gepager.h:57: error: `WindowInfo' is not a member of type `KWin'
xeplugin_gepager.h:57: error: template argument 1 is invalid
xeplugin_gepager.h:57: warning: ISO C++ forbids declaration of `windows' with
no type
kxdocker.cpp: In constructor `KXDocker::KXDocker()':
kxdocker.cpp:80: warning: comparison between signed and unsigned integer
expressions
kxdocker.cpp:82: warning: format not a string literal and no format arguments
make[2]: *** [kxdocker.o] Error 1
make[2]: Leaving directory `/home/*****/Documents/temp/kxdocker-0.17/src'
make[1]: *** [all-recursive] Error 1
make[1]: Leaving directory `/home/*****/Documents/temp/kxdocker-0.17'
make: *** [all] Error 2
linux:/home/*****/Documents/temp/kxdocker-0.17 #
------------------------------------------------------------
Cosa può essere ?
qaywsx è offline   Rispondi citando il messaggio o parte di esso
Old 01-06-2004, 16:53   #2
qaywsx
Senior Member
 
L'Avatar di qaywsx
 
Iscritto dal: Jan 2004
Messaggi: 426
uppo
qaywsx è offline   Rispondi citando il messaggio o parte di esso
Old 01-06-2004, 17:00   #3
pinball
Registered User
 
Iscritto dal: Nov 2000
Messaggi: 9315
SOLUZIONE



































pinball è offline   Rispondi citando il messaggio o parte di esso
Old 01-06-2004, 17:00   #4
ri
Senior Member
 
L'Avatar di ri
 
Iscritto dal: Feb 2003
Città: fra casa e lavoro
Messaggi: 1061
concordo
ri è offline   Rispondi citando il messaggio o parte di esso
Old 05-06-2004, 18:32   #5
qaywsx
Senior Member
 
L'Avatar di qaywsx
 
Iscritto dal: Jan 2004
Messaggi: 426
vuoi dire che con distro "più da puristi" tipo slack o debian si compila meglio ?
qaywsx è offline   Rispondi citando il messaggio o parte di esso
Old 05-06-2004, 19:42   #6
pinball
Registered User
 
Iscritto dal: Nov 2000
Messaggi: 9315
Quote:
Originariamente inviato da qaywsx
vuoi dire che con distro "più da puristi" tipo slack o debian si compila meglio ?

no, voglio dire che con debian il problema di compilare non si ripropone +!

vuoi installare un programma?

apt-get install nome_programma


e non devi fare nient'altro!

ciao!
pinball è offline   Rispondi citando il messaggio o parte di esso
 Rispondi


WoW Forever: la beta è stato uno dei momenti più alti della storia dei videogiochi, e non si ripeterà WoW Forever: la beta è stato uno dei mome...
Oracle AI World 2026: in Europa prima la sovranità, poi la sicurezza e solo dopo l'IA Oracle AI World 2026: in Europa prima la sovrani...
DS N°7 E-Tense: il SUV premium made in Melfi che punta su autonomia e comfort DS N°7 E-Tense: il SUV premium made in Melfi...
Recensione Samsung Galaxy Tab S12 Ultra: non chiamatelo tablet... è molto di più Recensione Samsung Galaxy Tab S12 Ultra: non chi...
Hyundai IONIQ 5 N, l'elettrica che finge di essere termica (e ci riesce da paura) Hyundai IONIQ 5 N, l'elettrica che finge di esse...
GTA 6 su PC potrebbe arrivare prima del ...
Da zero al tracciato in secondi: LibreCo...
Il regista Rian Johnson lancia a 12,99 d...
Microsoft stravolge l'app Sicurezza di W...
Mercato smartphone in caduta libera: -20...
Android 17 QPR3 Beta 3 riporta il blocco...
Le 10 offerte TOP in Amazon del weekend:...
Dyson, doppio crollo su Amazon: purifica...
Il 70% delle imprese non vede effetti de...
HillMiles MileCity1 a 616€: la city e-bi...
GAC Aion UT, prima prova: tanta roba a 2...
vivo X300 Pro a 979€: il top di gamma co...
AGIBOT fa ballare 110 Expedition A3 per ...
iPad A16 da 11'' scende a 459€ in tutti ...
Mac mini M6 crolla a 899€ (-180€ rispett...
Chromium
GPU-Z
OCCT
LibreOffice Portable
Opera One Portable
Opera One 106
CCleaner Portable
CCleaner Standard
Cpu-Z
Driver NVIDIA GeForce 546.65 WHQL
SmartFTP
Trillian
Google Chrome Portable
Google Chrome 120
VirtualBox
Tutti gli articoli Tutte le news Tutti i download

Strumenti

Regole
Non Puoi aprire nuove discussioni
Non Puoi rispondere ai messaggi
Non Puoi allegare file
Non Puoi modificare i tuoi messaggi

Il codice vB è On
Le Faccine sono On
Il codice [IMG] è On
Il codice HTML è Off
Vai al Forum


Tutti gli orari sono GMT +1. Ora sono le: 13:15.


Powered by vBulletin® Version 3.6.4
Copyright ©2000 - 2026, Jelsoft Enterprises Ltd.
Served by www3v