Torna indietro   Hardware Upgrade Forum > Software > Linux, Unix, OS alternativi > Linux per newbies

Nokia Innovation Day 2026: la sovranità europea passa dal mercato unico e dai laboratori italiani del gruppo
Nokia Innovation Day 2026: la sovranità europea passa dal mercato unico e dai laboratori italiani del gruppo
Politica, accademia e industria a confronto su mercato unico, sicurezza e competitività. Nei laboratori di Vimercate, Nokia ha mostrato le nuove generazioni di chip ottici e i test che ogni prodotto deve superare prima di arrivare sul mercato
In sella alla Fiido Nomads Pro: e-bike con motore centrale da 100 Nm per il divertimento a 360 gradi
In sella alla Fiido Nomads Pro: e-bike con motore centrale da 100 Nm per il divertimento a 360 gradi
Abbiamo assemblato e provato la Fiido Nomads Pro, evoluzione del modello da trekking già presente nella gamma, che migliora in tutto, soprattutto grazie al motore centrale, fluido e potente. Ottima app, costruzione solida e prezzo ok completano il quadro
ASUS Zenbook 14 (UX3480AA): tanta autonomia con uno chassis bello e robusto
ASUS Zenbook 14 (UX3480AA): tanta autonomia con uno chassis bello e robusto
Lo chassis in Ceraluminium è il cuore di questo notebook in edizione 2026, un modello pensato per garantire produttività con le tipiche applicazioni di produttività personale e capace di offrire un'autonomia di funzionamento lontano dalla presa di corrente da riferimento. Potenza, facilità di trasporto e costruzione robusta tutto in un notebook compatto.
Tutti gli articoli Tutte le news

Vai al Forum
Rispondi
 
Strumenti
Old 29-09-2007, 13:17   #1
bibi9000
Senior Member
 
L'Avatar di bibi9000
 
Iscritto dal: Sep 2006
Città: Pesaro
Messaggi: 582
sto installando checkinstall su debian ma mi da error in make.....

PERCHE' HO QUESTO ERRORE:
Quote:
SATURNO:/home/luca/02SOFTWARE/checkinstall# tar xvfz checkinstall-1.6.0beta4.tgzcheckinstall-1.6.0beta4/
checkinstall-1.6.0beta4/FAQ
checkinstall-1.6.0beta4/BUGS
checkinstall-1.6.0beta4/TODO
checkinstall-1.6.0beta4/Makefile
checkinstall-1.6.0beta4/doc-pak/
checkinstall-1.6.0beta4/doc-pak/FAQ
checkinstall-1.6.0beta4/doc-pak/BUGS
checkinstall-1.6.0beta4/doc-pak/TODO
checkinstall-1.6.0beta4/doc-pak/README
checkinstall-1.6.0beta4/doc-pak/installwatch-0.7.0beta4/
checkinstall-1.6.0beta4/doc-pak/installwatch-0.7.0beta4/BUGS
checkinstall-1.6.0beta4/doc-pak/installwatch-0.7.0beta4/TODO
checkinstall-1.6.0beta4/doc-pak/installwatch-0.7.0beta4/README
checkinstall-1.6.0beta4/doc-pak/installwatch-0.7.0beta4/CHANGELOG
checkinstall-1.6.0beta4/doc-pak/installwatch-0.7.0beta4/VERSION
checkinstall-1.6.0beta4/doc-pak/installwatch-0.7.0beta4/INSTALL
checkinstall-1.6.0beta4/doc-pak/installwatch-0.7.0beta4/COPYING
checkinstall-1.6.0beta4/doc-pak/NLS_SUPPORT
checkinstall-1.6.0beta4/doc-pak/RELNOTES
checkinstall-1.6.0beta4/doc-pak/INSTALL
checkinstall-1.6.0beta4/doc-pak/Changelog
checkinstall-1.6.0beta4/doc-pak/COPYING
checkinstall-1.6.0beta4/doc-pak/CREDITS
checkinstall-1.6.0beta4/README
checkinstall-1.6.0beta4/makepak
checkinstall-1.6.0beta4/installwatch-0.7.0beta4/
checkinstall-1.6.0beta4/installwatch-0.7.0beta4/er
checkinstall-1.6.0beta4/installwatch-0.7.0beta4/BUGS
checkinstall-1.6.0beta4/installwatch-0.7.0beta4/TODO
checkinstall-1.6.0beta4/installwatch-0.7.0beta4/create-localdecls
checkinstall-1.6.0beta4/installwatch-0.7.0beta4/Makefile
checkinstall-1.6.0beta4/installwatch-0.7.0beta4/README
checkinstall-1.6.0beta4/installwatch-0.7.0beta4/installwatch.c.rej
checkinstall-1.6.0beta4/installwatch-0.7.0beta4/CHANGELOG
checkinstall-1.6.0beta4/installwatch-0.7.0beta4/installwatch
checkinstall-1.6.0beta4/installwatch-0.7.0beta4/test-installwatch.c
checkinstall-1.6.0beta4/installwatch-0.7.0beta4/VERSION
checkinstall-1.6.0beta4/installwatch-0.7.0beta4/installwatch.c
checkinstall-1.6.0beta4/installwatch-0.7.0beta4/INSTALL
checkinstall-1.6.0beta4/installwatch-0.7.0beta4/libctest.c
checkinstall-1.6.0beta4/installwatch-0.7.0beta4/description-pak
checkinstall-1.6.0beta4/installwatch-0.7.0beta4/COPYING
checkinstall-1.6.0beta4/NLS_SUPPORT
checkinstall-1.6.0beta4/locale/
checkinstall-1.6.0beta4/locale/checkinstall-template.po
checkinstall-1.6.0beta4/locale/checkinstall-es.mo
checkinstall-1.6.0beta4/locale/checkinstall-es.po
checkinstall-1.6.0beta4/locale/checkinstall-ru.po
checkinstall-1.6.0beta4/locale/checkinstall-pt_BR.po
checkinstall-1.6.0beta4/locale/checkinstall-zh_CN.po
checkinstall-1.6.0beta4/checkinstall
checkinstall-1.6.0beta4/RELNOTES
checkinstall-1.6.0beta4/checkinstallrc-dist
checkinstall-1.6.0beta4/INSTALL
checkinstall-1.6.0beta4/Changelog
checkinstall-1.6.0beta4/description-pak
checkinstall-1.6.0beta4/COPYING
checkinstall-1.6.0beta4/CREDITS
SATURNO:/home/luca/02SOFTWARE/checkinstall# cd checkinstall-1.6.0beta4
SATURNO:/home/luca/02SOFTWARE/checkinstall/checkinstall-1.6.0beta4# make
make -C installwatch-0.7.0beta4
make[1]: Entering directory `/home/luca/02SOFTWARE/checkinstall/checkinstall-1.6.0beta4/installwatch-0.7.0beta4'
./create-localdecls
Checking truncate argument type... grep: /usr/include/unistd.h: No such file or directory
off_t
Checking libc version... ./create-localdecls: line 38: gcc: command not found
ldd: ./libctest: No such file or directory
rm: impossibile rimuovere `libctest': No such file or directory

gcc -Wall -c -D_GNU_SOURCE -DPIC -fPIC -D_REENTRANT -DVERSION=\"0.7.0beta3\" installwatch.c
make[1]: gcc: Command not found
make[1]: *** [installwatch.o] Error 127
make[1]: Leaving directory `/home/luca/02SOFTWARE/checkinstall/checkinstall-1.6.0beta4/installwatch-0.7.0beta4'
make: *** [all] Error 2
SATURNO:/home/luca/02SOFTWARE/checkinstall/checkinstall-1.6.0beta4#
ciao e grazie a tutti
__________________
Ciao ciao a tutti
bibi9000 è offline   Rispondi citando il messaggio o parte di esso
Old 29-09-2007, 13:19   #2
VICIUS
Senior Member
 
L'Avatar di VICIUS
 
Iscritto dal: Oct 2001
Messaggi: 11471
Quote:
make[1]: gcc: Command not found
Non hai installato il compilatore C. Sei sicuro di aver installato il pacchetto build-essential?

ciao
VICIUS è offline   Rispondi citando il messaggio o parte di esso
Old 29-09-2007, 14:27   #3
bibi9000
Senior Member
 
L'Avatar di bibi9000
 
Iscritto dal: Sep 2006
Città: Pesaro
Messaggi: 582
perchè ancora ...cosa sbaglio

Quote:
SATURNO:/home/luca/02SOFTWARE/essent-pack# sudo dpkg -i build-essential_11.3_i386.deb
Selezionato il pacchetto build-essential, che non lo era.
(Lettura del database ... 78199 file e directory attualmente installati.)
Spacchetto build-essential (da build-essential_11.3_i386.deb) ...
dpkg: problemi con le dipendenze impediscono la configurazione di build-essential:
build-essential dipende da libc6-dev | libc-dev; comunque:
Il pacchetto libc6-dev non è installato.
Il pacchetto libc-dev non è installato.
build-essential dipende da gcc (>= 4:4.1.1); comunque:
Il pacchetto gcc non è installato.
build-essential dipende da g++ (>= 4:4.1.1); comunque:
Il pacchetto g++ non è installato.
dpkg: errore processando build-essential (--install):
problemi con le dipendenze - lasciato non configurato
Sono occorsi degli errori processando:
build-essential
SATURNO:/home/luca/02SOFTWARE/essent-pack# cd /home/luca/02SOFTWARE/checkinstallSATURNO:/home/luca/02SOFTWARE/checkinstall# make
make: *** No targets specified and no makefile found. Stop.
SATURNO:/home/luca/02SOFTWARE/checkinstall# cd checkinstall-1.6.0beta4 SATURNO:/home/luca/02SOFTWARE/checkinstall/checkinstall-1.6.0beta4# make
make -C installwatch-0.7.0beta4
make[1]: Entering directory `/home/luca/02SOFTWARE/checkinstall/checkinstall-1.6.0beta4/installwatch-0.7.0beta4'
gcc -Wall -c -D_GNU_SOURCE -DPIC -fPIC -D_REENTRANT -DVERSION=\"0.7.0beta3\" installwatch.c
make[1]: gcc: Command not found
make[1]: *** [installwatch.o] Error 127
make[1]: Leaving directory `/home/luca/02SOFTWARE/checkinstall/checkinstall-1.6.0beta4/installwatch-0.7.0beta4'
make: *** [all] Error 2
SATURNO:/home/luca/02SOFTWARE/checkinstall/checkinstall-1.6.0beta4# make -C installwatch-0.7.0beta4
make: Entering directory `/home/luca/02SOFTWARE/checkinstall/checkinstall-1.6.0beta4/installwatch-0.7.0beta4'
gcc -Wall -c -D_GNU_SOURCE -DPIC -fPIC -D_REENTRANT -DVERSION=\"0.7.0beta3\" installwatch.c
make: gcc: Command not found
make: *** [installwatch.o] Error 127
make: Leaving directory `/home/luca/02SOFTWARE/checkinstall/checkinstall-1.6.0beta4/installwatch-0.7.0beta4'
SATURNO:/home/luca/02SOFTWARE/checkinstall/checkinstall-1.6.0beta4# sudo -s
SATURNO:/home/luca/02SOFTWARE/checkinstall/checkinstall-1.6.0beta4# make installmake -C installwatch-0.7.0beta4
make[1]: Entering directory `/home/luca/02SOFTWARE/checkinstall/checkinstall-1.6.0beta4/installwatch-0.7.0beta4'
gcc -Wall -c -D_GNU_SOURCE -DPIC -fPIC -D_REENTRANT -DVERSION=\"0.7.0beta3\" installwatch.c
make[1]: gcc: Command not found
make[1]: *** [installwatch.o] Error 127
make[1]: Leaving directory `/home/luca/02SOFTWARE/checkinstall/checkinstall-1.6.0beta4/installwatch-0.7.0beta4'
make: *** [all] Error 2
SATURNO:/home/luca/02SOFTWARE/checkinstall/checkinstall-1.6.0beta4#
SATURNO:/home/luca/02SOFTWARE/checkinstall/checkinstall-1.6.0beta4#

ciao e grazie
__________________
Ciao ciao a tutti
bibi9000 è offline   Rispondi citando il messaggio o parte di esso
Old 29-09-2007, 15:16   #4
bibi9000
Senior Member
 
L'Avatar di bibi9000
 
Iscritto dal: Sep 2006
Città: Pesaro
Messaggi: 582
tutto ok non avevo visto che build-essential aveva un errore nell'installazione.
ho usato syna.. è ho installato build-essential adesso:
make install ha funzionato grazie ciao
__________________
Ciao ciao a tutti
bibi9000 è offline   Rispondi citando il messaggio o parte di esso
 Rispondi


Nokia Innovation Day 2026: la sovranità europea passa dal mercato unico e dai laboratori italiani del gruppo Nokia Innovation Day 2026: la sovranità e...
In sella alla Fiido Nomads Pro: e-bike con motore centrale da 100 Nm per il divertimento a 360 gradi In sella alla Fiido Nomads Pro: e-bike con motor...
ASUS Zenbook 14 (UX3480AA): tanta autonomia con uno chassis bello e robusto ASUS Zenbook 14 (UX3480AA): tanta autonomia con ...
MSI PRO MAX: QD-OLED ultrawide per lavorare, creare e giocare MSI PRO MAX: QD-OLED ultrawide per lavorare, cre...
Samsung Micro RGB R95H, il primo LCD a LED rossi, verdi e blu di Samsung alla prova del banco di misura Samsung Micro RGB R95H, il primo LCD a LED rossi...
OnePlus non si ferma dopo l'addio all'Eu...
Epic Games ha rinviato il gioco di Disne...
Elon Musk versa oltre 276 milioni ai rep...
AMD EPYC Verano nelle mani di Lisa Su: f...
Meta presenta la sua prima IA di frontie...
Il buco nero di NGC 1275 si accende nei ...
Aito punta all'Europa: l'azienda automot...
Cloni di Word, Excel e PowerPoint gratis...
Windows 11 23H2, a novembre finiscono gl...
LineageOS compie 10 anni e festeggia con...
Recensione Mibro AeroPace: leggero nella...
La Russia sta perdendo la guerra dei dat...
Sconti Amazon aggiornati questa mattina:...
Robot aspirapolvere in offerta: Roborock...
MSI MAG a 99€ su Amazon: monitor gaming ...
Chromium
GPU-Z
OCCT
LibreOffice Portable
Opera One Portable
Opera One 106
CCleaner Portable
CCleaner Standard
Cpu-Z
Driver NVIDIA GeForce 546.65 WHQL
SmartFTP
Trillian
Google Chrome Portable
Google Chrome 120
VirtualBox
Tutti gli articoli Tutte le news Tutti i download

Strumenti

Regole
Non Puoi aprire nuove discussioni
Non Puoi rispondere ai messaggi
Non Puoi allegare file
Non Puoi modificare i tuoi messaggi

Il codice vB è On
Le Faccine sono On
Il codice [IMG] è On
Il codice HTML è Off
Vai al Forum


Tutti gli orari sono GMT +1. Ora sono le: 12:44.


Powered by vBulletin® Version 3.6.4
Copyright ©2000 - 2026, Jelsoft Enterprises Ltd.
Served by www3v