Torna indietro   Hardware Upgrade Forum > Software > Linux, Unix, OS alternativi

 Recensione OPPO Find X10 Pro Max: un top di gamma completo con tre fotocamere da 200MP
Recensione OPPO Find X10 Pro Max: un top di gamma completo con tre fotocamere da 200MP
OPPO ha appena lanciato sul mercato la nuova serie Find X10, che ha come smartphone premium il Find X10 Pro Max, uno smartphone completo, che fa del comparto fotografico il suo vero punto di forza. Ma sono tante le novità, tra cui l'AI che adesso diventa agentica. Ma andiamo a vedere nel dettaglio questo nuovo smartphone.
WoW Forever provato: il MMORPG che la community chiedeva da anni è arrivato
WoW Forever provato: il MMORPG che la community chiedeva da anni è arrivato
Abbiamo provato la beta di World of Warcraft: Forever, il Classic+ di Blizzard in arrivo il 4 novembre: la nuova razza Skyborne restituisce la sensazione di un gioco nuovo, ma le zone storiche conservano la noia divertita di Classic. Classi ribilanciate, sciamani anche nell'Alleanza e un motore grafico che in 4K gira bene anche su una RTX 3070. Cosa cambia in Forever? La risposta nell'articolo
TCL P80 Ultra: con un display AMOLED opaco è una gioia per gli occhi e per le dita
TCL P80 Ultra: con un display AMOLED opaco è una gioia per gli occhi e per le dita
TCL P80 Ultra abbina per la prima volta un pannello AMOLED alla tecnologia NXTPAPER con finitura opaca, affiancandoci una fotocamera periscopica da 50 MP con zoom ottico 3x, il SoC Dimensity 7400 Elite e una batteria da 5.800 mAh. Nella prova sul campo emergono luminosità di picco molto elevata, comparto fotografico solido per la fascia di prezzo e autonomia nella media, a fronte di velocità di scrittura dello storage piuttosto contenute
Tutti gli articoli Tutte le news

Vai al Forum
Rispondi
 
Strumenti
Old 16-06-2007, 15:28   #1
gepeppe
Senior Member
 
L'Avatar di gepeppe
 
Iscritto dal: Jun 2005
Città: Napoli
Messaggi: 2599
Non riesco ad installare vmware

salve, non riesco ad installare vmware workstation 6 su suse 10.2. l'ho scaricato dal sito, la versione di prova, ma quando vado a dare il comando vmware-config.pl per configurarlo, dopo varie risposte "positive", mi esce questo:

Codice:
Trying to find a suitable vmmon module for your running kernel.

None of the pre-built vmmon modules for VMware Workstation is suitable for your
running kernel.  Do you want this program to try to build the vmmon module for
your system (you need to have a C compiler installed on your system)? [yes] yes

Using compiler "/usr/bin/gcc". Use environment variable CC to override.

In file included from <stdin>:2:
/lib/modules/2.6.18.8-0.3-default/build/include/linux/utsrelease.h:1:1: warning: "UTS_RELEASE" redefined
In file included from <stdin>:1:
/lib/modules/2.6.18.8-0.3-default/build/include/linux/version.h:40:1: warning: this is the location of the previous definition
In file included from <stdin>:2:
/lib/modules/2.6.18.8-0.3-default/build/include/linux/utsrelease.h:1:1: warning: "UTS_RELEASE" redefined
In file included from <stdin>:1:
/lib/modules/2.6.18.8-0.3-default/build/include/linux/version.h:40:1: warning: this is the location of the previous definition
What is the location of the directory of C header files that match your running
kernel? [/lib/modules/2.6.18.8-0.3-default/build/include] /lib/modules/2.6.18.8-0.3-default/build/include

In file included from <stdin>:2:
/lib/modules/2.6.18.8-0.3-default/build/include/linux/utsrelease.h:1:1: warning: "UTS_RELEASE" redefined
In file included from <stdin>:1:
/lib/modules/2.6.18.8-0.3-default/build/include/linux/version.h:40:1: warning: this is the location of the previous definition
Extracting the sources of the vmmon module.

Building the vmmon module.

Using 2.6.x kernel build system.
make: Entering directory `/tmp/vmware-config1/vmmon-only'
make -C /lib/modules/2.6.18.8-0.3-default/build/include/.. SUBDIRS=$PWD SRCROOT=$PWD/. modules
make[1]: Entering directory `/usr/src/linux-2.6.18.8-0.3-obj/x86_64/default'
make -C ../../../linux-2.6.18.8-0.3 O=../linux-2.6.18.8-0.3-obj/x86_64/default modules
  CC [M]  /tmp/vmware-config1/vmmon-only/linux/driver.o
In file included from /tmp/vmware-config1/vmmon-only/./include/compat_version.h:21,
                 from /tmp/vmware-config1/vmmon-only/./include/driver-config.h:22,
                 from /tmp/vmware-config1/vmmon-only/linux/driver.c:6:
include/linux/version.h:2:2: error: #error "======================================================="
include/linux/version.h:3:2: error: #error "You should not include /usr/include/{linux,asm}/ header"
include/linux/version.h:4:2: error: #error "files directly for the compilation of kernel modules."
include/linux/version.h:5:2: error: #error ""
include/linux/version.h:6:2: error: #error "glibc now uses kernel header files from a well-defined"
include/linux/version.h:7:2: error: #error "working kernel version (as recommended by Linus Torvalds)"
include/linux/version.h:8:2: error: #error "These files are glibc internal and may not match the"
include/linux/version.h:9:2: error: #error "currently running kernel. They should only be"
include/linux/version.h:10:2: error: #error "included via other system header files - user space"
include/linux/version.h:11:2: error: #error "programs should not directly include <linux/*.h> or"
include/linux/version.h:12:2: error: #error "<asm/*.h> as well."
include/linux/version.h:13:2: error: #error ""
include/linux/version.h:14:2: error: #error "To build kernel modules please do the following:"
include/linux/version.h:15:2: error: #error ""
include/linux/version.h:16:2: error: #error " o Have the kernel sources installed"
include/linux/version.h:17:2: error: #error ""
include/linux/version.h:18:2: error: #error " o Make sure that the symbolic link"
include/linux/version.h:19:2: error: #error "   /lib/modules/`uname -r`/build exists and points to"
include/linux/version.h:20:2: error: #error "   the matching kernel source directory"
include/linux/version.h:21:2: error: #error ""
include/linux/version.h:22:2: error: #error " o Configure kernel sources:"
include/linux/version.h:23:2: error: #error "   - cd /usr/src/linux"
include/linux/version.h:24:2: error: #error "   - make mrproper"
include/linux/version.h:25:2: error: #error "   - make cloneconfig"
include/linux/version.h:26:2: error: #error "   - make dep"
include/linux/version.h:27:2: error: #error ""
include/linux/version.h:28:2: error: #error " o When compiling, make sure to use the following"
include/linux/version.h:29:2: error: #error "   compiler option to use the correct include files:"
include/linux/version.h:30:2: error: #error ""
include/linux/version.h:31:2: error: #error "   -I/lib/modules/`uname -r`/build/include"
include/linux/version.h:32:2: error: #error ""
include/linux/version.h:33:2: error: #error "   instead of"
include/linux/version.h:34:2: error: #error ""
include/linux/version.h:35:2: error: #error "   -I/usr/include/linux"
include/linux/version.h:36:2: error: #error ""
include/linux/version.h:37:2: error: #error "   Please adjust the Makefile accordingly."
include/linux/version.h:38:2: error: #error "======================================================="
In file included from /tmp/vmware-config1/vmmon-only/./include/driver-config.h:22,
                 from /tmp/vmware-config1/vmmon-only/linux/driver.c:6:
/tmp/vmware-config1/vmmon-only/./include/compat_version.h:39:5: warning: "LINUX_VERSION_CODE" is not defined
/tmp/vmware-config1/vmmon-only/./include/compat_version.h:43:5: warning: "LINUX_VERSION_CODE" is not defined
/tmp/vmware-config1/vmmon-only/./include/compat_version.h:47:5: warning: "LINUX_VERSION_CODE" is not defined
/tmp/vmware-config1/vmmon-only/./include/compat_version.h:51:5: warning: "LINUX_VERSION_CODE" is not defined
/tmp/vmware-config1/vmmon-only/./include/compat_version.h:56:5: warning: "LINUX_VERSION_CODE" is not defined
/tmp/vmware-config1/vmmon-only/./include/compat_version.h:61:5: warning: "LINUX_VERSION_CODE" is not defined
/tmp/vmware-config1/vmmon-only/./include/compat_version.h:66:5: warning: "LINUX_VERSION_CODE" is not defined
/tmp/vmware-config1/vmmon-only/./include/compat_version.h:71:5: warning: "LINUX_VERSION_CODE" is not defined
/tmp/vmware-config1/vmmon-only/./include/compat_version.h:76:5: warning: "LINUX_VERSION_CODE" is not defined
/tmp/vmware-config1/vmmon-only/./include/compat_version.h:81:5: warning: "LINUX_VERSION_CODE" is not defined
/tmp/vmware-config1/vmmon-only/./include/compat_version.h:86:5: warning: "LINUX_VERSION_CODE" is not defined
/tmp/vmware-config1/vmmon-only/./include/compat_version.h:91:5: warning: "LINUX_VERSION_CODE" is not defined
/tmp/vmware-config1/vmmon-only/./include/compat_version.h:96:5: warning: "LINUX_VERSION_CODE" is not defined
/tmp/vmware-config1/vmmon-only/./include/compat_version.h:101:5: warning: "LINUX_VERSION_CODE" is not defined
In file included from /tmp/vmware-config1/vmmon-only/linux/driver.c:10:
include/linux/version.h:2:2: error: #error "======================================================="
include/linux/version.h:3:2: error: #error "You should not include /usr/include/{linux,asm}/ header"
include/linux/version.h:4:2: error: #error "files directly for the compilation of kernel modules."
include/linux/version.h:5:2: error: #error ""
include/linux/version.h:6:2: error: #error "glibc now uses kernel header files from a well-defined"
include/linux/version.h:7:2: error: #error "working kernel version (as recommended by Linus Torvalds)"
include/linux/version.h:8:2: error: #error "These files are glibc internal and may not match the"
include/linux/version.h:9:2: error: #error "currently running kernel. They should only be"
include/linux/version.h:10:2: error: #error "included via other system header files - user space"
include/linux/version.h:11:2: error: #error "programs should not directly include <linux/*.h> or"
include/linux/version.h:12:2: error: #error "<asm/*.h> as well."
include/linux/version.h:13:2: error: #error ""
include/linux/version.h:14:2: error: #error "To build kernel modules please do the following:"
include/linux/version.h:15:2: error: #error ""
include/linux/version.h:16:2: error: #error " o Have the kernel sources installed"
include/linux/version.h:17:2: error: #error ""
include/linux/version.h:18:2: error: #error " o Make sure that the symbolic link"
include/linux/version.h:19:2: error: #error "   /lib/modules/`uname -r`/build exists and points to"
include/linux/version.h:20:2: error: #error "   the matching kernel source directory"
include/linux/version.h:21:2: error: #error ""
include/linux/version.h:22:2: error: #error " o Configure kernel sources:"
include/linux/version.h:23:2: error: #error "   - cd /usr/src/linux"
include/linux/version.h:24:2: error: #error "   - make mrproper"
include/linux/version.h:25:2: error: #error "   - make cloneconfig"
include/linux/version.h:26:2: error: #error "   - make dep"
include/linux/version.h:27:2: error: #error ""
include/linux/version.h:28:2: error: #error " o When compiling, make sure to use the following"
include/linux/version.h:29:2: error: #error "   compiler option to use the correct include files:"
include/linux/version.h:30:2: error: #error ""
include/linux/version.h:31:2: error: #error "   -I/lib/modules/`uname -r`/build/include"
include/linux/version.h:32:2: error: #error ""
include/linux/version.h:33:2: error: #error "   instead of"
include/linux/version.h:34:2: error: #error ""
include/linux/version.h:35:2: error: #error "   -I/usr/include/linux"
include/linux/version.h:36:2: error: #error ""
include/linux/version.h:37:2: error: #error "   Please adjust the Makefile accordingly."
include/linux/version.h:38:2: error: #error "======================================================="
In file included from include2/asm/seccomp.h:11,
                 from include/linux/seccomp.h:10,
                 from include/linux/sched.h:73,
                 from include/linux/module.h:9,
                 from /tmp/vmware-config1/vmmon-only/linux/driver.c:12:
include/linux/unistd.h:5:2: error: #error use syscall(2) instead, and who defines __KERNEL__ in userland anyway?!
/tmp/vmware-config1/vmmon-only/linux/driver.c:18:29: error: linux/malloc.h: No such file or directory
In file included from include/linux/vmstat.h:6,
                 from include/linux/mm.h:522,
                 from include/linux/poll.h:11,
                 from /tmp/vmware-config1/vmmon-only/linux/driver.c:25:
include/linux/config.h:4:1: warning: "CONFIG_SMP" redefined
In file included from /tmp/vmware-config1/vmmon-only/./include/driver-config.h:21,
                 from /tmp/vmware-config1/vmmon-only/linux/driver.c:6:
include/linux/autoconf.h:2019:1: warning: this is the location of the previous definition
/tmp/vmware-config1/vmmon-only/linux/driver.c:32:28: warning: "LINUX_VERSION_CODE" is not defined
/tmp/vmware-config1/vmmon-only/linux/driver.c:33:8: warning: "LINUX_VERSION_CODE" is not defined
/tmp/vmware-config1/vmmon-only/linux/driver.c:34:31: error: asm/ioctl32.h: No such file or directory
/tmp/vmware-config1/vmmon-only/linux/driver.c:39:8: warning: "LINUX_VERSION_CODE" is not defined
In file included from /tmp/vmware-config1/vmmon-only/linux/driver.h:19,
                 from /tmp/vmware-config1/vmmon-only/linux/driver.c:49:
/tmp/vmware-config1/vmmon-only/./include/compat_spinlock.h:12:5: warning: "LINUX_VERSION_CODE" is not defined
/tmp/vmware-config1/vmmon-only/./include/compat_spinlock.h:15:8: warning: "LINUX_VERSION_CODE" is not defined
In file included from /tmp/vmware-config1/vmmon-only/linux/driver.h:19,
                 from /tmp/vmware-config1/vmmon-only/linux/driver.c:49:
/tmp/vmware-config1/vmmon-only/./include/compat_spinlock.h:18: error: conflicting types for ‘spinlock_t’
include/linux/spinlock_types.h:32: error: previous declaration of ‘spinlock_t’ was here
/tmp/vmware-config1/vmmon-only/./include/compat_spinlock.h:19:1: warning: "spin_lock_init" redefined
In file included from include/linux/capability.h:45,
                 from include/linux/sched.h:44,
                 from include/linux/module.h:9,
                 from /tmp/vmware-config1/vmmon-only/linux/driver.c:12:
include/linux/spinlock.h:104:1: warning: this is the location of the previous definition
In file included from /tmp/vmware-config1/vmmon-only/linux/driver.h:19,
                 from /tmp/vmware-config1/vmmon-only/linux/driver.c:49:
/tmp/vmware-config1/vmmon-only/./include/compat_spinlock.h:20:1: warning: "spin_lock" redefined
In file included from include/linux/capability.h:45,
                 from include/linux/sched.h:44,
                 from include/linux/module.h:9,
                 from /tmp/vmware-config1/vmmon-only/linux/driver.c:12:
include/linux/spinlock.h:176:1: warning: this is the location of the previous definition
In file included from /tmp/vmware-config1/vmmon-only/linux/driver.h:19,
                 from /tmp/vmware-config1/vmmon-only/linux/driver.c:49:
/tmp/vmware-config1/vmmon-only/./include/compat_spinlock.h:21:1: warning: "spin_unlock" redefined
In file included from include/linux/capability.h:45,
                 from include/linux/sched.h:44,
                 from include/linux/module.h:9,
                 from /tmp/vmware-config1/vmmon-only/linux/driver.c:12:
include/linux/spinlock.h:218:1: warning: this is the location of the previous definition
In file included from /tmp/vmware-config1/vmmon-only/linux/driver.h:19,
                 from /tmp/vmware-config1/vmmon-only/linux/driver.c:49:
/tmp/vmware-config1/vmmon-only/./include/compat_spinlock.h:22:1: warning: "spin_lock_irqsave" redefined
In file included from include/linux/capability.h:45,
                 from include/linux/sched.h:44,
                 from include/linux/module.h:9,
                 from /tmp/vmware-config1/vmmon-only/linux/driver.c:12:
include/linux/spinlock.h:188:1: warning: this is the location of the previous definition
In file included from /tmp/vmware-config1/vmmon-only/linux/driver.h:19,
                 from /tmp/vmware-config1/vmmon-only/linux/driver.c:49:
/tmp/vmware-config1/vmmon-only/./include/compat_spinlock.h:27:1: warning: "spin_unlock_irqrestore" redefined
In file included from include/linux/capability.h:45,
                 from include/linux/sched.h:44,
                 from include/linux/module.h:9,
                 from /tmp/vmware-config1/vmmon-only/linux/driver.c:12:
include/linux/spinlock.h:229:1: warning: this is the location of the previous definition
In file included from /tmp/vmware-config1/vmmon-only/./include/compat_wait.h:9,
                 from /tmp/vmware-config1/vmmon-only/./include/vmci_kernel_defs.h:26,
                 from /tmp/vmware-config1/vmmon-only/./common/vmciContext.h:19,
                 from /tmp/vmware-config1/vmmon-only/linux/driver.h:21,
                 from /tmp/vmware-config1/vmmon-only/linux/driver.c:49:
/tmp/vmware-config1/vmmon-only/./include/compat_file.h:6:5: warning: "LINUX_VERSION_CODE" is not defined
/tmp/vmware-config1/vmmon-only/./include/compat_file.h:13:5: warning: "LINUX_VERSION_CODE" is not defined
/tmp/vmware-config1/vmmon-only/./include/compat_file.h:22:5: warning: "LINUX_VERSION_CODE" is not defined
In file included from /tmp/vmware-config1/vmmon-only/./include/compat_wait.h:9,
                 from /tmp/vmware-config1/vmmon-only/./include/vmci_kernel_defs.h:26,
                 from /tmp/vmware-config1/vmmon-only/./common/vmciContext.h:19,
                 from /tmp/vmware-config1/vmmon-only/linux/driver.h:21,
                 from /tmp/vmware-config1/vmmon-only/linux/driver.c:49:
/tmp/vmware-config1/vmmon-only/./include/compat_file.h: In function ‘compat_filp_close’:
/tmp/vmware-config1/vmmon-only/./include/compat_file.h:27: error: too few arguments to function ‘filp->f_op->flush’
In file included from /tmp/vmware-config1/vmmon-only/./include/vmci_kernel_defs.h:26,
                 from /tmp/vmware-config1/vmmon-only/./common/vmciContext.h:19,
                 from /tmp/vmware-config1/vmmon-only/linux/driver.h:21,
                 from /tmp/vmware-config1/vmmon-only/linux/driver.c:49:
/tmp/vmware-config1/vmmon-only/./include/compat_wait.h:37:5: warning: "VMW_HAVE_EPOLL" is not defined
/tmp/vmware-config1/vmmon-only/./include/compat_wait.h:43:5: warning: "VMW_HAVE_EPOLL" is not defined
/tmp/vmware-config1/vmmon-only/./include/compat_wait.h:57:7: warning: "LINUX_VERSION_CODE" is not defined
In file included from /tmp/vmware-config1/vmmon-only/./include/vmci_kernel_defs.h:26,
                 from /tmp/vmware-config1/vmmon-only/./common/vmciContext.h:19,
                 from /tmp/vmware-config1/vmmon-only/linux/driver.h:21,
                 from /tmp/vmware-config1/vmmon-only/linux/driver.c:49:
/tmp/vmware-config1/vmmon-only/./include/compat_wait.h: At top level:
/tmp/vmware-config1/vmmon-only/./include/compat_wait.h:83: error: conflicting types for ‘poll_freewait’
include/linux/poll.h:63: error: previous declaration of ‘poll_freewait’ was here
/tmp/vmware-config1/vmmon-only/./include/compat_wait.h: In function ‘poll_freewait’:
/tmp/vmware-config1/vmmon-only/./include/compat_wait.h:88: error: ‘poll_table’ has no member named ‘entry’
/tmp/vmware-config1/vmmon-only/./include/compat_wait.h:88: error: ‘poll_table’ has no member named ‘nr’
/tmp/vmware-config1/vmmon-only/./include/compat_wait.h:89: error: ‘poll_table’ has no member named ‘nr’
/tmp/vmware-config1/vmmon-only/./include/compat_wait.h:90: error: ‘poll_table’ has no member named ‘nr’
/tmp/vmware-config1/vmmon-only/./include/compat_wait.h:93: error: ‘struct file’ has no member named ‘f_inode’
/tmp/vmware-config1/vmmon-only/./include/compat_wait.h:93: error: too many arguments to function ‘fput’
/tmp/vmware-config1/vmmon-only/./include/compat_wait.h:96: error: ‘poll_table’ has no member named ‘next’
In file included from /tmp/vmware-config1/vmmon-only/./include/vmci_kernel_defs.h:27,
                 from /tmp/vmware-config1/vmmon-only/./common/vmciContext.h:19,
                 from /tmp/vmware-config1/vmmon-only/linux/driver.h:21,
                 from /tmp/vmware-config1/vmmon-only/linux/driver.c:49:
/tmp/vmware-config1/vmmon-only/./include/compat_interrupt.h:7:5: warning: "LINUX_VERSION_CODE" is not defined
/tmp/vmware-config1/vmmon-only/./include/compat_interrupt.h:23:5: warning: "LINUX_VERSION_CODE" is not defined
In file included from /tmp/vmware-config1/vmmon-only/./include/vmci_kernel_defs.h:29,
                 from /tmp/vmware-config1/vmmon-only/./common/vmciContext.h:19,
                 from /tmp/vmware-config1/vmmon-only/linux/driver.h:21,
                 from /tmp/vmware-config1/vmmon-only/linux/driver.c:49:
/tmp/vmware-config1/vmmon-only/./include/compat_slab.h:5:5: warning: "LINUX_VERSION_CODE" is not defined
/tmp/vmware-config1/vmmon-only/./include/compat_slab.h:18:5: warning: "LINUX_VERSION_CODE" is not defined
In file included from /tmp/vmware-config1/vmmon-only/./common/vmciContext.h:19,
                 from /tmp/vmware-config1/vmmon-only/linux/driver.h:21,
                 from /tmp/vmware-config1/vmmon-only/linux/driver.c:49:
/tmp/vmware-config1/vmmon-only/./include/vmci_kernel_defs.h:195:5: warning: "LINUX_VERSION_CODE" is not defined
In file included from /tmp/vmware-config1/vmmon-only/./common/vmciContext.h:19,
                 from /tmp/vmware-config1/vmmon-only/linux/driver.h:21,
                 from /tmp/vmware-config1/vmmon-only/linux/driver.c:49:
/tmp/vmware-config1/vmmon-only/./include/vmci_kernel_defs.h: In function ‘VMCI_GrabLock_BH’:
/tmp/vmware-config1/vmmon-only/./include/vmci_kernel_defs.h:205: error: implicit declaration of function ‘save_flags’
/tmp/vmware-config1/vmmon-only/./include/vmci_kernel_defs.h:205: error: implicit declaration of function ‘cli’
/tmp/vmware-config1/vmmon-only/./include/vmci_kernel_defs.h:243:5: warning: "LINUX_VERSION_CODE" is not defined
/tmp/vmware-config1/vmmon-only/./include/vmci_kernel_defs.h: In function ‘VMCI_ReleaseLock_BH’:
/tmp/vmware-config1/vmmon-only/./include/vmci_kernel_defs.h:253: error: implicit declaration of function ‘restore_flags’
In file included from /tmp/vmware-config1/vmmon-only/linux/vmhost.h:13,
                 from /tmp/vmware-config1/vmmon-only/linux/driver.c:80:
/tmp/vmware-config1/vmmon-only/./include/compat_semaphore.h:13:5: warning: "LINUX_VERSION_CODE" is not defined
In file included from /tmp/vmware-config1/vmmon-only/linux/driver.c:84:
/tmp/vmware-config1/vmmon-only/./include/compat_uaccess.h:6:5: warning: "LINUX_VERSION_CODE" is not defined
/tmp/vmware-config1/vmmon-only/./include/compat_uaccess.h:14:5: warning: "LINUX_VERSION_CODE" is not defined
/tmp/vmware-config1/vmmon-only/./include/compat_uaccess.h:47:33: warning: "LINUX_VERSION_CODE" is not defined
In file included from /tmp/vmware-config1/vmmon-only/linux/driver.c:85:
/tmp/vmware-config1/vmmon-only/./include/compat_page.h:10:5: warning: "LINUX_VERSION_CODE" is not defined
/tmp/vmware-config1/vmmon-only/./include/compat_page.h:17:5: warning: "LINUX_VERSION_CODE" is not defined
In file included from /tmp/vmware-config1/vmmon-only/linux/driver.c:86:
/tmp/vmware-config1/vmmon-only/./include/compat_timer.h:11:5: warning: "LINUX_VERSION_CODE" is not defined
/tmp/vmware-config1/vmmon-only/./include/compat_timer.h:14:28: error: asm/softirq.h: No such file or directory
In file included from /tmp/vmware-config1/vmmon-only/linux/driver.c:86:
/tmp/vmware-config1/vmmon-only/./include/compat_timer.h: In function ‘compat_del_timer_sync’:
/tmp/vmware-config1/vmmon-only/./include/compat_timer.h:21: error: implicit declaration of function ‘start_bh_atomic’
/tmp/vmware-config1/vmmon-only/./include/compat_timer.h:23: error: implicit declaration of function ‘end_bh_atomic’
/tmp/vmware-config1/vmmon-only/./include/compat_timer.h:33:5: warning: "LINUX_VERSION_CODE" is not defined
/tmp/vmware-config1/vmmon-only/./include/compat_timer.h:43:8: warning: "LINUX_VERSION_CODE" is not defined
/tmp/vmware-config1/vmmon-only/./include/compat_timer.h:49:8: warning: "LINUX_VERSION_CODE" is not defined
/tmp/vmware-config1/vmmon-only/./include/compat_timer.h:50:1: warning: "set_current_state" redefined
In file included from include/linux/module.h:9,
                 from /tmp/vmware-config1/vmmon-only/linux/driver.c:12:
include/linux/sched.h:170:1: warning: this is the location of the previous definition
In file included from /tmp/vmware-config1/vmmon-only/linux/driver.c:87:
/tmp/vmware-config1/vmmon-only/./include/compat_mm.h:10:5: warning: "LINUX_VERSION_CODE" is not defined
/tmp/vmware-config1/vmmon-only/./include/compat_mm.h:13:8: warning: "LINUX_VERSION_CODE" is not defined
/tmp/vmware-config1/vmmon-only/./include/compat_mm.h:18:1: warning: "page_to_phys" redefined
In file included from /tmp/vmware-config1/vmmon-only/linux/driver.c:31:
include2/asm/io.h:126:1: warning: this is the location of the previous definition
In file included from /tmp/vmware-config1/vmmon-only/linux/driver.c:87:
/tmp/vmware-config1/vmmon-only/./include/compat_mm.h:28:5: warning: "LINUX_VERSION_CODE" is not defined
/tmp/vmware-config1/vmmon-only/./include/compat_mm.h:33:5: warning: "LINUX_VERSION_CODE" is not defined
/tmp/vmware-config1/vmmon-only/./include/compat_mm.h:72:5: warning: "LINUX_VERSION_CODE" is not defined
In file included from /tmp/vmware-config1/vmmon-only/linux/driver.c:87:
/tmp/vmware-config1/vmmon-only/./include/compat_mm.h: At top level:
/tmp/vmware-config1/vmmon-only/./include/compat_mm.h:77: error: redefinition of ‘alloc_pages’
include/linux/gfp.h:127: error: previous definition of ‘alloc_pages’ was here
/tmp/vmware-config1/vmmon-only/./include/compat_mm.h: In function ‘alloc_pages’:
/tmp/vmware-config1/vmmon-only/./include/compat_mm.h:84: error: ‘mem_map’ undeclared (first use in this function)
/tmp/vmware-config1/vmmon-only/./include/compat_mm.h:84: error: (Each undeclared identifier is reported only once
/tmp/vmware-config1/vmmon-only/./include/compat_mm.h:84: error: for each function it appears in.)
/tmp/vmware-config1/vmmon-only/./include/compat_mm.h:95:5: warning: "LINUX_VERSION_CODE" is not defined
/tmp/vmware-config1/vmmon-only/./include/compat_mm.h:104:5: warning: "LINUX_VERSION_CODE" is not defined
In file included from /tmp/vmware-config1/vmmon-only/linux/driver.c:88:
/tmp/vmware-config1/vmmon-only/./include/compat_highmem.h:12:5: warning: "LINUX_VERSION_CODE" is not defined
/tmp/vmware-config1/vmmon-only/./include/compat_highmem.h:19:1: warning: "kunmap" redefined
In file included from include/linux/pagemap.h:10,
                 from /tmp/vmware-config1/vmmon-only/./include/compat_highmem.h:16,
                 from /tmp/vmware-config1/vmmon-only/linux/driver.c:88:
include/linux/highmem.h:38:1: warning: this is the location of the previous definition
In file included from /tmp/vmware-config1/vmmon-only/linux/driver.c:89:
/tmp/vmware-config1/vmmon-only/./include/compat_kernel.h:19:5: warning: "LINUX_VERSION_CODE" is not defined
In file included from /tmp/vmware-config1/vmmon-only/./include/compat_kernel.h:25,
                 from /tmp/vmware-config1/vmmon-only/linux/driver.c:89:
/tmp/vmware-config1/vmmon-only/./include/compat_completion.h:19:5: warning: "LINUX_VERSION_CODE" is not defined
/tmp/vmware-config1/vmmon-only/./include/compat_completion.h:53:7: warning: "LINUX_VERSION_CODE" is not defined
In file included from /tmp/vmware-config1/vmmon-only/linux/driver.c:90:
/tmp/vmware-config1/vmmon-only/linux/vmmonInt.h:34:28: warning: "LINUX_VERSION_CODE" is not defined
/tmp/vmware-config1/vmmon-only/linux/driver.c:94:5: warning: "LINUX_VERSION_CODE" is not defined
/tmp/vmware-config1/vmmon-only/linux/driver.c: At top level:
/tmp/vmware-config1/vmmon-only/linux/driver.c:150: warning: initialization from incompatible pointer type
/tmp/vmware-config1/vmmon-only/linux/driver.c:211:5: warning: "LINUX_VERSION_CODE" is not defined
/tmp/vmware-config1/vmmon-only/linux/driver.c: In function ‘LinuxDriver_Ioctl3264Passthrough’:
/tmp/vmware-config1/vmmon-only/linux/driver.c:218: error: implicit declaration of function ‘verify_area’
/tmp/vmware-config1/vmmon-only/linux/driver.c:218: error: implicit declaration of function ‘memcpy_fromfs’
/tmp/vmware-config1/vmmon-only/linux/driver.c:243:5: warning: "LINUX_VERSION_CODE" is not defined
/tmp/vmware-config1/vmmon-only/linux/driver.c: In function ‘register_ioctl32_handlers’:
/tmp/vmware-config1/vmmon-only/linux/driver.c:248: error: implicit declaration of function ‘register_ioctl32_conversion’
/tmp/vmware-config1/vmmon-only/linux/driver.c:263:5: warning: "LINUX_VERSION_CODE" is not defined
/tmp/vmware-config1/vmmon-only/linux/driver.c: In function ‘unregister_ioctl32_handlers’:
/tmp/vmware-config1/vmmon-only/linux/driver.c:265: error: implicit declaration of function ‘unregister_ioctl32_conversion’
/tmp/vmware-config1/vmmon-only/linux/driver.c: In function ‘LinuxDriver_Open’:
/tmp/vmware-config1/vmmon-only/linux/driver.c:514: error: ‘MOD_INC_USE_COUNT’ undeclared (first use in this function)
/tmp/vmware-config1/vmmon-only/linux/driver.c:518: error: ‘MOD_DEC_USE_COUNT’ undeclared (first use in this function)
/tmp/vmware-config1/vmmon-only/linux/driver.c: In function ‘LinuxDriverAllocPages’:
/tmp/vmware-config1/vmmon-only/linux/driver.c:588: error: ‘struct page’ has no member named ‘count’
/tmp/vmware-config1/vmmon-only/linux/driver.c:591: error: ‘mem_map’ undeclared (first use in this function)
/tmp/vmware-config1/vmmon-only/linux/driver.c: In function ‘LinuxDriverDestructor4Gb’:
/tmp/vmware-config1/vmmon-only/linux/driver.c:632: error: ‘mem_map’ undeclared (first use in this function)
/tmp/vmware-config1/vmmon-only/linux/driver.c: In function ‘LinuxDriver_Close’:
/tmp/vmware-config1/vmmon-only/linux/driver.c:737: error: ‘MOD_DEC_USE_COUNT’ undeclared (first use in this function)
/tmp/vmware-config1/vmmon-only/linux/driver.c: At top level:
/tmp/vmware-config1/vmmon-only/linux/driver.c:743: error: unknown field ‘raw_lock’ specified in initializer
/tmp/vmware-config1/vmmon-only/linux/driver.c:743: error: extra brace group at end of initializer
/tmp/vmware-config1/vmmon-only/linux/driver.c:743: error: (near initialization for ‘(anonymous)’)
/tmp/vmware-config1/vmmon-only/linux/driver.c:743: warning: excess elements in struct initializer
/tmp/vmware-config1/vmmon-only/linux/driver.c:743: warning: (near initialization for ‘(anonymous)’)
/tmp/vmware-config1/vmmon-only/linux/driver.c: In function ‘LinuxDriverPoll’:
/tmp/vmware-config1/vmmon-only/linux/driver.c:1040: error: unknown field ‘raw_lock’ specified in initializer
/tmp/vmware-config1/vmmon-only/linux/driver.c:1040: error: extra brace group at end of initializer
/tmp/vmware-config1/vmmon-only/linux/driver.c:1040: error: (near initialization for ‘(anonymous)’)
/tmp/vmware-config1/vmmon-only/linux/driver.c:1040: warning: excess elements in struct initializer
/tmp/vmware-config1/vmmon-only/linux/driver.c:1040: warning: (near initialization for ‘(anonymous)’)
/tmp/vmware-config1/vmmon-only/linux/driver.c:1040: warning: unused variable ‘timerLock’
/tmp/vmware-config1/vmmon-only/linux/driver.c: In function ‘LinuxDriverNoPage’:
/tmp/vmware-config1/vmmon-only/linux/driver.c:1122: error: ‘struct vm_area_struct’ has no member named ‘vm_offset’
/tmp/vmware-config1/vmmon-only/linux/driver.c:1128: error: ‘struct page’ has no member named ‘count’
/tmp/vmware-config1/vmmon-only/linux/driver.c:1135: warning: return makes integer from pointer without a cast
/tmp/vmware-config1/vmmon-only/linux/driver.c: In function ‘LinuxDriverAllocContig’:
/tmp/vmware-config1/vmmon-only/linux/driver.c:1217: error: ‘mem_map’ undeclared (first use in this function)
/tmp/vmware-config1/vmmon-only/linux/driver.c:1233:7: warning: "LINUX_VERSION_CODE" is not defined
/tmp/vmware-config1/vmmon-only/linux/driver.c: In function ‘LinuxDriverMmap’:
/tmp/vmware-config1/vmmon-only/linux/driver.c:1279: error: ‘struct vm_area_struct’ has no member named ‘vm_offset’
/tmp/vmware-config1/vmmon-only/linux/driver.c:1286:5: warning: "LINUX_VERSION_CODE" is not defined
/tmp/vmware-config1/vmmon-only/linux/driver.c:1288: error: wrong type argument to increment
/tmp/vmware-config1/vmmon-only/linux/driver.c:1439:5: warning: "LINUX_VERSION_CODE" is not defined
/tmp/vmware-config1/vmmon-only/linux/driver.c:1683:5: warning: "LINUX_VERSION_CODE" is not defined
/tmp/vmware-config1/vmmon-only/linux/driver.c:1714:5: warning: "LINUX_VERSION_CODE" is not defined
/tmp/vmware-config1/vmmon-only/linux/driver.c: In function ‘LinuxDriver_Ioctl’:
/tmp/vmware-config1/vmmon-only/linux/driver.c:1717: error: ‘struct task_struct’ has no member named ‘dumpable’
/tmp/vmware-config1/vmmon-only/linux/driver.c:1999:5: warning: "LINUX_VERSION_CODE" is not defined
make[4]: *** [/tmp/vmware-config1/vmmon-only/linux/driver.o] Error 1
make[3]: *** [_module_/tmp/vmware-config1/vmmon-only] Error 2
make[2]: *** [modules] Error 2
make[1]: *** [modules] Error 2
make[1]: Leaving directory `/usr/src/linux-2.6.18.8-0.3-obj/x86_64/default'
make: *** [vmmon.ko] Error 2
make: Leaving directory `/tmp/vmware-config1/vmmon-only'
Unable to build the vmmon module.

For more information on how to troubleshoot module-related problems, please
visit our Web site at "http://www.vmware.com/download/modules/modules.html" and
"http://www.vmware.com/support/reference/linux/prebuilt_modules_linux.html".

Execution aborted.

linux-suse:/usr/bin # /lib/modules/2.6.18.8-0.3-default/build/include
Trying to find a suitable vmmon module for your running kernel.

None of the pre-built vmmon modules for VMware Workstation is suitable for your
running kernel.  Do you want this program to try to build the vmmon module for
your system (you need to have a C compiler installed on your system)? [yes] yes

Using compiler "/usr/bin/gcc". Use environment variable CC to override.

In file included from <stdin>:2:
/lib/modules/2.6.18.8-0.3-default/build/include/linux/utsrelease.h:1:1: warning: "UTS_RELEASE" redefined
In file included from <stdin>:1:
/lib/modules/2.6.18.8-0.3-default/build/include/linux/version.h:40:1: warning: this is the location of the previous definition
In file included from <stdin>:2:
/lib/modules/2.6.18.8-0.3-default/build/include/linux/utsrelease.h:1:1: warning: "UTS_RELEASE" redefined
In file included from <stdin>:1:
/lib/modules/2.6.18.8-0.3-default/build/include/linux/version.h:40:1: warning: this is the location of the previous definition
What is the location of the directory of C header files that match your running
kernel? [/lib/modules/2.6.18.8-0.3-default/build/include] /lib/modules/2.6.18.8-0.3-default/build/include

In file included from <stdin>:2:
/lib/modules/2.6.18.8-0.3-default/build/include/linux/utsrelease.h:1:1: warning: "UTS_RELEASE" redefined
In file included from <stdin>:1:
/lib/modules/2.6.18.8-0.3-default/build/include/linux/version.h:40:1: warning: this is the location of the previous definition
Extracting the sources of the vmmon module.

Building the vmmon module.

Using 2.6.x kernel build system.
make: Entering directory `/tmp/vmware-config1/vmmon-only'
make -C /lib/modules/2.6.18.8-0.3-default/build/include/.. SUBDIRS=$PWD SRCROOT=$PWD/. modules
make[1]: Entering directory `/usr/src/linux-2.6.18.8-0.3-obj/x86_64/default'
make -C ../../../linux-2.6.18.8-0.3 O=../linux-2.6.18.8-0.3-obj/x86_64/default modules
  CC [M]  /tmp/vmware-config1/vmmon-only/linux/driver.o
In file included from /tmp/vmware-config1/vmmon-only/./include/compat_version.h:21,
                 from /tmp/vmware-config1/vmmon-only/./include/driver-config.h:22,
                 from /tmp/vmware-config1/vmmon-only/linux/driver.c:6:
include/linux/version.h:2:2: error: #error "======================================================="
include/linux/version.h:3:2: error: #error "You should not include /usr/include/{linux,asm}/ header"
include/linux/version.h:4:2: error: #error "files directly for the compilation of kernel modules."
include/linux/version.h:5:2: error: #error ""
include/linux/version.h:6:2: error: #error "glibc now uses kernel header files from a well-defined"
include/linux/version.h:7:2: error: #error "working kernel version (as recommended by Linus Torvalds)"
include/linux/version.h:8:2: error: #error "These files are glibc internal and may not match the"
include/linux/version.h:9:2: error: #error "currently running kernel. They should only be"
include/linux/version.h:10:2: error: #error "included via other system header files - user space"
include/linux/version.h:11:2: error: #error "programs should not directly include <linux/*.h> or"
include/linux/version.h:12:2: error: #error "<asm/*.h> as well."
include/linux/version.h:13:2: error: #error ""
include/linux/version.h:14:2: error: #error "To build kernel modules please do the following:"
include/linux/version.h:15:2: error: #error ""
include/linux/version.h:16:2: error: #error " o Have the kernel sources installed"
include/linux/version.h:17:2: error: #error ""
include/linux/version.h:18:2: error: #error " o Make sure that the symbolic link"
include/linux/version.h:19:2: error: #error "   /lib/modules/`uname -r`/build exists and points to"
include/linux/version.h:20:2: error: #error "   the matching kernel source directory"
include/linux/version.h:21:2: error: #error ""
include/linux/version.h:22:2: error: #error " o Configure kernel sources:"
include/linux/version.h:23:2: error: #error "   - cd /usr/src/linux"
include/linux/version.h:24:2: error: #error "   - make mrproper"
include/linux/version.h:25:2: error: #error "   - make cloneconfig"
include/linux/version.h:26:2: error: #error "   - make dep"
include/linux/version.h:27:2: error: #error ""
include/linux/version.h:28:2: error: #error " o When compiling, make sure to use the following"
include/linux/version.h:29:2: error: #error "   compiler option to use the correct include files:"
include/linux/version.h:30:2: error: #error ""
include/linux/version.h:31:2: error: #error "   -I/lib/modules/`uname -r`/build/include"
include/linux/version.h:32:2: error: #error ""
include/linux/version.h:33:2: error: #error "   instead of"
include/linux/version.h:34:2: error: #error ""
include/linux/version.h:35:2: error: #error "   -I/usr/include/linux"
include/linux/version.h:36:2: error: #error ""
include/linux/version.h:37:2: error: #error "   Please adjust the Makefile accordingly."
include/linux/version.h:38:2: error: #error "======================================================="
In file included from /tmp/vmware-config1/vmmon-only/./include/driver-config.h:22,
                 from /tmp/vmware-config1/vmmon-only/linux/driver.c:6:
/tmp/vmware-config1/vmmon-only/./include/compat_version.h:39:5: warning: "LINUX_VERSION_CODE" is not defined
/tmp/vmware-config1/vmmon-only/./include/compat_version.h:43:5: warning: "LINUX_VERSION_CODE" is not defined
/tmp/vmware-config1/vmmon-only/./include/compat_version.h:47:5: warning: "LINUX_VERSION_CODE" is not defined
/tmp/vmware-config1/vmmon-only/./include/compat_version.h:51:5: warning: "LINUX_VERSION_CODE" is not defined
/tmp/vmware-config1/vmmon-only/./include/compat_version.h:56:5: warning: "LINUX_VERSION_CODE" is not defined
/tmp/vmware-config1/vmmon-only/./include/compat_version.h:61:5: warning: "LINUX_VERSION_CODE" is not defined
/tmp/vmware-config1/vmmon-only/./include/compat_version.h:66:5: warning: "LINUX_VERSION_CODE" is not defined
/tmp/vmware-config1/vmmon-only/./include/compat_version.h:71:5: warning: "LINUX_VERSION_CODE" is not defined
/tmp/vmware-config1/vmmon-only/./include/compat_version.h:76:5: warning: "LINUX_VERSION_CODE" is not defined
/tmp/vmware-config1/vmmon-only/./include/compat_version.h:81:5: warning: "LINUX_VERSION_CODE" is not defined
/tmp/vmware-config1/vmmon-only/./include/compat_version.h:86:5: warning: "LINUX_VERSION_CODE" is not defined
/tmp/vmware-config1/vmmon-only/./include/compat_version.h:91:5: warning: "LINUX_VERSION_CODE" is not defined
/tmp/vmware-config1/vmmon-only/./include/compat_version.h:96:5: warning: "LINUX_VERSION_CODE" is not defined
/tmp/vmware-config1/vmmon-only/./include/compat_version.h:101:5: warning: "LINUX_VERSION_CODE" is not defined
In file included from /tmp/vmware-config1/vmmon-only/linux/driver.c:10:
include/linux/version.h:2:2: error: #error "======================================================="
include/linux/version.h:3:2: error: #error "You should not include /usr/include/{linux,asm}/ header"
include/linux/version.h:4:2: error: #error "files directly for the compilation of kernel modules."
include/linux/version.h:5:2: error: #error ""
include/linux/version.h:6:2: error: #error "glibc now uses kernel header files from a well-defined"
include/linux/version.h:7:2: error: #error "working kernel version (as recommended by Linus Torvalds)"
include/linux/version.h:8:2: error: #error "These files are glibc internal and may not match the"
include/linux/version.h:9:2: error: #error "currently running kernel. They should only be"
include/linux/version.h:10:2: error: #error "included via other system header files - user space"
include/linux/version.h:11:2: error: #error "programs should not directly include <linux/*.h> or"
include/linux/version.h:12:2: error: #error "<asm/*.h> as well."
include/linux/version.h:13:2: error: #error ""
include/linux/version.h:14:2: error: #error "To build kernel modules please do the following:"
include/linux/version.h:15:2: error: #error ""
include/linux/version.h:16:2: error: #error " o Have the kernel sources installed"
include/linux/version.h:17:2: error: #error ""
include/linux/version.h:18:2: error: #error " o Make sure that the symbolic link"
include/linux/version.h:19:2: error: #error "   /lib/modules/`uname -r`/build exists and points to"
include/linux/version.h:20:2: error: #error "   the matching kernel source directory"
include/linux/version.h:21:2: error: #error ""
include/linux/version.h:22:2: error: #error " o Configure kernel sources:"
include/linux/version.h:23:2: error: #error "   - cd /usr/src/linux"
include/linux/version.h:24:2: error: #error "   - make mrproper"
include/linux/version.h:25:2: error: #error "   - make cloneconfig"
include/linux/version.h:26:2: error: #error "   - make dep"
include/linux/version.h:27:2: error: #error ""
include/linux/version.h:28:2: error: #error " o When compiling, make sure to use the following"
include/linux/version.h:29:2: error: #error "   compiler option to use the correct include files:"
include/linux/version.h:30:2: error: #error ""
include/linux/version.h:31:2: error: #error "   -I/lib/modules/`uname -r`/build/include"
include/linux/version.h:32:2: error: #error ""
include/linux/version.h:33:2: error: #error "   instead of"
include/linux/version.h:34:2: error: #error ""
include/linux/version.h:35:2: error: #error "   -I/usr/include/linux"
include/linux/version.h:36:2: error: #error ""
include/linux/version.h:37:2: error: #error "   Please adjust the Makefile accordingly."
include/linux/version.h:38:2: error: #error "======================================================="
In file included from include2/asm/seccomp.h:11,
                 from include/linux/seccomp.h:10,
                 from include/linux/sched.h:73,
                 from include/linux/module.h:9,
                 from /tmp/vmware-config1/vmmon-only/linux/driver.c:12:
include/linux/unistd.h:5:2: error: #error use syscall(2) instead, and who defines __KERNEL__ in userland anyway?!
/tmp/vmware-config1/vmmon-only/linux/driver.c:18:29: error: linux/malloc.h: No such file or directory
In file included from include/linux/vmstat.h:6,
                 from include/linux/mm.h:522,
                 from include/linux/poll.h:11,
                 from /tmp/vmware-config1/vmmon-only/linux/driver.c:25:
include/linux/config.h:4:1: warning: "CONFIG_SMP" redefined
In file included from /tmp/vmware-config1/vmmon-only/./include/driver-config.h:21,
                 from /tmp/vmware-config1/vmmon-only/linux/driver.c:6:
include/linux/autoconf.h:2019:1: warning: this is the location of the previous definition
/tmp/vmware-config1/vmmon-only/linux/driver.c:32:28: warning: "LINUX_VERSION_CODE" is not defined
/tmp/vmware-config1/vmmon-only/linux/driver.c:33:8: warning: "LINUX_VERSION_CODE" is not defined
/tmp/vmware-config1/vmmon-only/linux/driver.c:34:31: error: asm/ioctl32.h: No such file or directory
/tmp/vmware-config1/vmmon-only/linux/driver.c:39:8: warning: "LINUX_VERSION_CODE" is not defined
In file included from /tmp/vmware-config1/vmmon-only/linux/driver.h:19,
                 from /tmp/vmware-config1/vmmon-only/linux/driver.c:49:
/tmp/vmware-config1/vmmon-only/./include/compat_spinlock.h:12:5: warning: "LINUX_VERSION_CODE" is not defined
/tmp/vmware-config1/vmmon-only/./include/compat_spinlock.h:15:8: warning: "LINUX_VERSION_CODE" is not defined
In file included from /tmp/vmware-config1/vmmon-only/linux/driver.h:19,
                 from /tmp/vmware-config1/vmmon-only/linux/driver.c:49:
/tmp/vmware-config1/vmmon-only/./include/compat_spinlock.h:18: error: conflicting types for ‘spinlock_t’
include/linux/spinlock_types.h:32: error: previous declaration of ‘spinlock_t’ was here
/tmp/vmware-config1/vmmon-only/./include/compat_spinlock.h:19:1: warning: "spin_lock_init" redefined
In file included from include/linux/capability.h:45,
                 from include/linux/sched.h:44,
                 from include/linux/module.h:9,
                 from /tmp/vmware-config1/vmmon-only/linux/driver.c:12:
include/linux/spinlock.h:104:1: warning: this is the location of the previous definition
In file included from /tmp/vmware-config1/vmmon-only/linux/driver.h:19,
                 from /tmp/vmware-config1/vmmon-only/linux/driver.c:49:
/tmp/vmware-config1/vmmon-only/./include/compat_spinlock.h:20:1: warning: "spin_lock" redefined
In file included from include/linux/capability.h:45,
                 from include/linux/sched.h:44,
                 from include/linux/module.h:9,
                 from /tmp/vmware-config1/vmmon-only/linux/driver.c:12:
include/linux/spinlock.h:176:1: warning: this is the location of the previous definition
In file included from /tmp/vmware-config1/vmmon-only/linux/driver.h:19,
                 from /tmp/vmware-config1/vmmon-only/linux/driver.c:49:
/tmp/vmware-config1/vmmon-only/./include/compat_spinlock.h:21:1: warning: "spin_unlock" redefined
In file included from include/linux/capability.h:45,
                 from include/linux/sched.h:44,
                 from include/linux/module.h:9,
                 from /tmp/vmware-config1/vmmon-only/linux/driver.c:12:
include/linux/spinlock.h:218:1: warning: this is the location of the previous definition
In file included from /tmp/vmware-config1/vmmon-only/linux/driver.h:19,
                 from /tmp/vmware-config1/vmmon-only/linux/driver.c:49:
/tmp/vmware-config1/vmmon-only/./include/compat_spinlock.h:22:1: warning: "spin_lock_irqsave" redefined
In file included from include/linux/capability.h:45,
                 from include/linux/sched.h:44,
                 from include/linux/module.h:9,
                 from /tmp/vmware-config1/vmmon-only/linux/driver.c:12:
include/linux/spinlock.h:188:1: warning: this is the location of the previous definition
In file included from /tmp/vmware-config1/vmmon-only/linux/driver.h:19,
                 from /tmp/vmware-config1/vmmon-only/linux/driver.c:49:
/tmp/vmware-config1/vmmon-only/./include/compat_spinlock.h:27:1: warning: "spin_unlock_irqrestore" redefined
In file included from include/linux/capability.h:45,
                 from include/linux/sched.h:44,
                 from include/linux/module.h:9,
                 from /tmp/vmware-config1/vmmon-only/linux/driver.c:12:
include/linux/spinlock.h:229:1: warning: this is the location of the previous definition
In file included from /tmp/vmware-config1/vmmon-only/./include/compat_wait.h:9,
                 from /tmp/vmware-config1/vmmon-only/./include/vmci_kernel_defs.h:26,
                 from /tmp/vmware-config1/vmmon-only/./common/vmciContext.h:19,
                 from /tmp/vmware-config1/vmmon-only/linux/driver.h:21,
                 from /tmp/vmware-config1/vmmon-only/linux/driver.c:49:
/tmp/vmware-config1/vmmon-only/./include/compat_file.h:6:5: warning: "LINUX_VERSION_CODE" is not defined
/tmp/vmware-config1/vmmon-only/./include/compat_file.h:13:5: warning: "LINUX_VERSION_CODE" is not defined
/tmp/vmware-config1/vmmon-only/./include/compat_file.h:22:5: warning: "LINUX_VERSION_CODE" is not defined
In file included from /tmp/vmware-config1/vmmon-only/./include/compat_wait.h:9,
                 from /tmp/vmware-config1/vmmon-only/./include/vmci_kernel_defs.h:26,
                 from /tmp/vmware-config1/vmmon-only/./common/vmciContext.h:19,
                 from /tmp/vmware-config1/vmmon-only/linux/driver.h:21,
                 from /tmp/vmware-config1/vmmon-only/linux/driver.c:49:
/tmp/vmware-config1/vmmon-only/./include/compat_file.h: In function ‘compat_filp_close’:
/tmp/vmware-config1/vmmon-only/./include/compat_file.h:27: error: too few arguments to function ‘filp->f_op->flush’
In file included from /tmp/vmware-config1/vmmon-only/./include/vmci_kernel_defs.h:26,
                 from /tmp/vmware-config1/vmmon-only/./common/vmciContext.h:19,
                 from /tmp/vmware-config1/vmmon-only/linux/driver.h:21,
                 from /tmp/vmware-config1/vmmon-only/linux/driver.c:49:
/tmp/vmware-config1/vmmon-only/./include/compat_wait.h:37:5: warning: "VMW_HAVE_EPOLL" is not defined
/tmp/vmware-config1/vmmon-only/./include/compat_wait.h:43:5: warning: "VMW_HAVE_EPOLL" is not defined
/tmp/vmware-config1/vmmon-only/./include/compat_wait.h:57:7: warning: "LINUX_VERSION_CODE" is not defined
In file included from /tmp/vmware-config1/vmmon-only/./include/vmci_kernel_defs.h:26,
                 from /tmp/vmware-config1/vmmon-only/./common/vmciContext.h:19,
                 from /tmp/vmware-config1/vmmon-only/linux/driver.h:21,
                 from /tmp/vmware-config1/vmmon-only/linux/driver.c:49:
/tmp/vmware-config1/vmmon-only/./include/compat_wait.h: At top level:
/tmp/vmware-config1/vmmon-only/./include/compat_wait.h:83: error: conflicting types for ‘poll_freewait’
include/linux/poll.h:63: error: previous declaration of ‘poll_freewait’ was here
/tmp/vmware-config1/vmmon-only/./include/compat_wait.h: In function ‘poll_freewait’:
/tmp/vmware-config1/vmmon-only/./include/compat_wait.h:88: error: ‘poll_table’ has no member named ‘entry’
/tmp/vmware-config1/vmmon-only/./include/compat_wait.h:88: error: ‘poll_table’ has no member named ‘nr’
/tmp/vmware-config1/vmmon-only/./include/compat_wait.h:89: error: ‘poll_table’ has no member named ‘nr’
/tmp/vmware-config1/vmmon-only/./include/compat_wait.h:90: error: ‘poll_table’ has no member named ‘nr’
/tmp/vmware-config1/vmmon-only/./include/compat_wait.h:93: error: ‘struct file’ has no member named ‘f_inode’
/tmp/vmware-config1/vmmon-only/./include/compat_wait.h:93: error: too many arguments to function ‘fput’
/tmp/vmware-config1/vmmon-only/./include/compat_wait.h:96: error: ‘poll_table’ has no member named ‘next’
In file included from /tmp/vmware-config1/vmmon-only/./include/vmci_kernel_defs.h:27,
                 from /tmp/vmware-config1/vmmon-only/./common/vmciContext.h:19,
                 from /tmp/vmware-config1/vmmon-only/linux/driver.h:21,
                 from /tmp/vmware-config1/vmmon-only/linux/driver.c:49:
/tmp/vmware-config1/vmmon-only/./include/compat_interrupt.h:7:5: warning: "LINUX_VERSION_CODE" is not defined
/tmp/vmware-config1/vmmon-only/./include/compat_interrupt.h:23:5: warning: "LINUX_VERSION_CODE" is not defined
In file included from /tmp/vmware-config1/vmmon-only/./include/vmci_kernel_defs.h:29,
                 from /tmp/vmware-config1/vmmon-only/./common/vmciContext.h:19,
                 from /tmp/vmware-config1/vmmon-only/linux/driver.h:21,
                 from /tmp/vmware-config1/vmmon-only/linux/driver.c:49:
/tmp/vmware-config1/vmmon-only/./include/compat_slab.h:5:5: warning: "LINUX_VERSION_CODE" is not defined
/tmp/vmware-config1/vmmon-only/./include/compat_slab.h:18:5: warning: "LINUX_VERSION_CODE" is not defined
In file included from /tmp/vmware-config1/vmmon-only/./common/vmciContext.h:19,
                 from /tmp/vmware-config1/vmmon-only/linux/driver.h:21,
                 from /tmp/vmware-config1/vmmon-only/linux/driver.c:49:
/tmp/vmware-config1/vmmon-only/./include/vmci_kernel_defs.h:195:5: warning: "LINUX_VERSION_CODE" is not defined
In file included from /tmp/vmware-config1/vmmon-only/./common/vmciContext.h:19,
                 from /tmp/vmware-config1/vmmon-only/linux/driver.h:21,
                 from /tmp/vmware-config1/vmmon-only/linux/driver.c:49:
/tmp/vmware-config1/vmmon-only/./include/vmci_kernel_defs.h: In function ‘VMCI_GrabLock_BH’:
/tmp/vmware-config1/vmmon-only/./include/vmci_kernel_defs.h:205: error: implicit declaration of function ‘save_flags’
/tmp/vmware-config1/vmmon-only/./include/vmci_kernel_defs.h:205: error: implicit declaration of function ‘cli’
/tmp/vmware-config1/vmmon-only/./include/vmci_kernel_defs.h:243:5: warning: "LINUX_VERSION_CODE" is not defined
/tmp/vmware-config1/vmmon-only/./include/vmci_kernel_defs.h: In function ‘VMCI_ReleaseLock_BH’:
/tmp/vmware-config1/vmmon-only/./include/vmci_kernel_defs.h:253: error: implicit declaration of function ‘restore_flags’
In file included from /tmp/vmware-config1/vmmon-only/linux/vmhost.h:13,
                 from /tmp/vmware-config1/vmmon-only/linux/driver.c:80:
/tmp/vmware-config1/vmmon-only/./include/compat_semaphore.h:13:5: warning: "LINUX_VERSION_CODE" is not defined
In file included from /tmp/vmware-config1/vmmon-only/linux/driver.c:84:
/tmp/vmware-config1/vmmon-only/./include/compat_uaccess.h:6:5: warning: "LINUX_VERSION_CODE" is not defined
/tmp/vmware-config1/vmmon-only/./include/compat_uaccess.h:14:5: warning: "LINUX_VERSION_CODE" is not defined
/tmp/vmware-config1/vmmon-only/./include/compat_uaccess.h:47:33: warning: "LINUX_VERSION_CODE" is not defined
In file included from /tmp/vmware-config1/vmmon-only/linux/driver.c:85:
/tmp/vmware-config1/vmmon-only/./include/compat_page.h:10:5: warning: "LINUX_VERSION_CODE" is not defined
/tmp/vmware-config1/vmmon-only/./include/compat_page.h:17:5: warning: "LINUX_VERSION_CODE" is not defined
In file included from /tmp/vmware-config1/vmmon-only/linux/driver.c:86:
/tmp/vmware-config1/vmmon-only/./include/compat_timer.h:11:5: warning: "LINUX_VERSION_CODE" is not defined
/tmp/vmware-config1/vmmon-only/./include/compat_timer.h:14:28: error: asm/softirq.h: No such file or directory
In file included from /tmp/vmware-config1/vmmon-only/linux/driver.c:86:
/tmp/vmware-config1/vmmon-only/./include/compat_timer.h: In function ‘compat_del_timer_sync’:
/tmp/vmware-config1/vmmon-only/./include/compat_timer.h:21: error: implicit declaration of function ‘start_bh_atomic’
/tmp/vmware-config1/vmmon-only/./include/compat_timer.h:23: error: implicit declaration of function ‘end_bh_atomic’
/tmp/vmware-config1/vmmon-only/./include/compat_timer.h:33:5: warning: "LINUX_VERSION_CODE" is not defined
/tmp/vmware-config1/vmmon-only/./include/compat_timer.h:43:8: warning: "LINUX_VERSION_CODE" is not defined
/tmp/vmware-config1/vmmon-only/./include/compat_timer.h:49:8: warning: "LINUX_VERSION_CODE" is not defined
/tmp/vmware-config1/vmmon-only/./include/compat_timer.h:50:1: warning: "set_current_state" redefined
In file included from include/linux/module.h:9,
                 from /tmp/vmware-config1/vmmon-only/linux/driver.c:12:
include/linux/sched.h:170:1: warning: this is the location of the previous definition
In file included from /tmp/vmware-config1/vmmon-only/linux/driver.c:87:
/tmp/vmware-config1/vmmon-only/./include/compat_mm.h:10:5: warning: "LINUX_VERSION_CODE" is not defined
/tmp/vmware-config1/vmmon-only/./include/compat_mm.h:13:8: warning: "LINUX_VERSION_CODE" is not defined
/tmp/vmware-config1/vmmon-only/./include/compat_mm.h:18:1: warning: "page_to_phys" redefined
In file included from /tmp/vmware-config1/vmmon-only/linux/driver.c:31:
include2/asm/io.h:126:1: warning: this is the location of the previous definition
In file included from /tmp/vmware-config1/vmmon-only/linux/driver.c:87:
/tmp/vmware-config1/vmmon-only/./include/compat_mm.h:28:5: warning: "LINUX_VERSION_CODE" is not defined
/tmp/vmware-config1/vmmon-only/./include/compat_mm.h:33:5: warning: "LINUX_VERSION_CODE" is not defined
/tmp/vmware-config1/vmmon-only/./include/compat_mm.h:72:5: warning: "LINUX_VERSION_CODE" is not defined
In file included from /tmp/vmware-config1/vmmon-only/linux/driver.c:87:
/tmp/vmware-config1/vmmon-only/./include/compat_mm.h: At top level:
/tmp/vmware-config1/vmmon-only/./include/compat_mm.h:77: error: redefinition of ‘alloc_pages’
include/linux/gfp.h:127: error: previous definition of ‘alloc_pages’ was here
/tmp/vmware-config1/vmmon-only/./include/compat_mm.h: In function ‘alloc_pages’:
/tmp/vmware-config1/vmmon-only/./include/compat_mm.h:84: error: ‘mem_map’ undeclared (first use in this function)
/tmp/vmware-config1/vmmon-only/./include/compat_mm.h:84: error: (Each undeclared identifier is reported only once
/tmp/vmware-config1/vmmon-only/./include/compat_mm.h:84: error: for each function it appears in.)
/tmp/vmware-config1/vmmon-only/./include/compat_mm.h:95:5: warning: "LINUX_VERSION_CODE" is not defined
/tmp/vmware-config1/vmmon-only/./include/compat_mm.h:104:5: warning: "LINUX_VERSION_CODE" is not defined
In file included from /tmp/vmware-config1/vmmon-only/linux/driver.c:88:
/tmp/vmware-config1/vmmon-only/./include/compat_highmem.h:12:5: warning: "LINUX_VERSION_CODE" is not defined
/tmp/vmware-config1/vmmon-only/./include/compat_highmem.h:19:1: warning: "kunmap" redefined
In file included from include/linux/pagemap.h:10,
                 from /tmp/vmware-config1/vmmon-only/./include/compat_highmem.h:16,
                 from /tmp/vmware-config1/vmmon-only/linux/driver.c:88:
include/linux/highmem.h:38:1: warning: this is the location of the previous definition
In file included from /tmp/vmware-config1/vmmon-only/linux/driver.c:89:
/tmp/vmware-config1/vmmon-only/./include/compat_kernel.h:19:5: warning: "LINUX_VERSION_CODE" is not defined
In file included from /tmp/vmware-config1/vmmon-only/./include/compat_kernel.h:25,
                 from /tmp/vmware-config1/vmmon-only/linux/driver.c:89:
/tmp/vmware-config1/vmmon-only/./include/compat_completion.h:19:5: warning: "LINUX_VERSION_CODE" is not defined
/tmp/vmware-config1/vmmon-only/./include/compat_completion.h:53:7: warning: "LINUX_VERSION_CODE" is not defined
In file included from /tmp/vmware-config1/vmmon-only/linux/driver.c:90:
/tmp/vmware-config1/vmmon-only/linux/vmmonInt.h:34:28: warning: "LINUX_VERSION_CODE" is not defined
/tmp/vmware-config1/vmmon-only/linux/driver.c:94:5: warning: "LINUX_VERSION_CODE" is not defined
/tmp/vmware-config1/vmmon-only/linux/driver.c: At top level:
/tmp/vmware-config1/vmmon-only/linux/driver.c:150: warning: initialization from incompatible pointer type
/tmp/vmware-config1/vmmon-only/linux/driver.c:211:5: warning: "LINUX_VERSION_CODE" is not defined
/tmp/vmware-config1/vmmon-only/linux/driver.c: In function ‘LinuxDriver_Ioctl3264Passthrough’:
/tmp/vmware-config1/vmmon-only/linux/driver.c:218: error: implicit declaration of function ‘verify_area’
/tmp/vmware-config1/vmmon-only/linux/driver.c:218: error: implicit declaration of function ‘memcpy_fromfs’
/tmp/vmware-config1/vmmon-only/linux/driver.c:243:5: warning: "LINUX_VERSION_CODE" is not defined
/tmp/vmware-config1/vmmon-only/linux/driver.c: In function ‘register_ioctl32_handlers’:
/tmp/vmware-config1/vmmon-only/linux/driver.c:248: error: implicit declaration of function ‘register_ioctl32_conversion’
/tmp/vmware-config1/vmmon-only/linux/driver.c:263:5: warning: "LINUX_VERSION_CODE" is not defined
/tmp/vmware-config1/vmmon-only/linux/driver.c: In function ‘unregister_ioctl32_handlers’:
/tmp/vmware-config1/vmmon-only/linux/driver.c:265: error: implicit declaration of function ‘unregister_ioctl32_conversion’
/tmp/vmware-config1/vmmon-only/linux/driver.c: In function ‘LinuxDriver_Open’:
/tmp/vmware-config1/vmmon-only/linux/driver.c:514: error: ‘MOD_INC_USE_COUNT’ undeclared (first use in this function)
/tmp/vmware-config1/vmmon-only/linux/driver.c:518: error: ‘MOD_DEC_USE_COUNT’ undeclared (first use in this function)
/tmp/vmware-config1/vmmon-only/linux/driver.c: In function ‘LinuxDriverAllocPages’:
/tmp/vmware-config1/vmmon-only/linux/driver.c:588: error: ‘struct page’ has no member named ‘count’
/tmp/vmware-config1/vmmon-only/linux/driver.c:591: error: ‘mem_map’ undeclared (first use in this function)
/tmp/vmware-config1/vmmon-only/linux/driver.c: In function ‘LinuxDriverDestructor4Gb’:
/tmp/vmware-config1/vmmon-only/linux/driver.c:632: error: ‘mem_map’ undeclared (first use in this function)
/tmp/vmware-config1/vmmon-only/linux/driver.c: In function ‘LinuxDriver_Close’:
/tmp/vmware-config1/vmmon-only/linux/driver.c:737: error: ‘MOD_DEC_USE_COUNT’ undeclared (first use in this function)
/tmp/vmware-config1/vmmon-only/linux/driver.c: At top level:
/tmp/vmware-config1/vmmon-only/linux/driver.c:743: error: unknown field ‘raw_lock’ specified in initializer
/tmp/vmware-config1/vmmon-only/linux/driver.c:743: error: extra brace group at end of initializer
/tmp/vmware-config1/vmmon-only/linux/driver.c:743: error: (near initialization for ‘(anonymous)’)
/tmp/vmware-config1/vmmon-only/linux/driver.c:743: warning: excess elements in struct initializer
/tmp/vmware-config1/vmmon-only/linux/driver.c:743: warning: (near initialization for ‘(anonymous)’)
/tmp/vmware-config1/vmmon-only/linux/driver.c: In function ‘LinuxDriverPoll’:
/tmp/vmware-config1/vmmon-only/linux/driver.c:1040: error: unknown field ‘raw_lock’ specified in initializer
/tmp/vmware-config1/vmmon-only/linux/driver.c:1040: error: extra brace group at end of initializer
/tmp/vmware-config1/vmmon-only/linux/driver.c:1040: error: (near initialization for ‘(anonymous)’)
/tmp/vmware-config1/vmmon-only/linux/driver.c:1040: warning: excess elements in struct initializer
/tmp/vmware-config1/vmmon-only/linux/driver.c:1040: warning: (near initialization for ‘(anonymous)’)
/tmp/vmware-config1/vmmon-only/linux/driver.c:1040: warning: unused variable ‘timerLock’
/tmp/vmware-config1/vmmon-only/linux/driver.c: In function ‘LinuxDriverNoPage’:
/tmp/vmware-config1/vmmon-only/linux/driver.c:1122: error: ‘struct vm_area_struct’ has no member named ‘vm_offset’
/tmp/vmware-config1/vmmon-only/linux/driver.c:1128: error: ‘struct page’ has no member named ‘count’
/tmp/vmware-config1/vmmon-only/linux/driver.c:1135: warning: return makes integer from pointer without a cast
/tmp/vmware-config1/vmmon-only/linux/driver.c: In function ‘LinuxDriverAllocContig’:
/tmp/vmware-config1/vmmon-only/linux/driver.c:1217: error: ‘mem_map’ undeclared (first use in this function)
/tmp/vmware-config1/vmmon-only/linux/driver.c:1233:7: warning: "LINUX_VERSION_CODE" is not defined
/tmp/vmware-config1/vmmon-only/linux/driver.c: In function ‘LinuxDriverMmap’:
/tmp/vmware-config1/vmmon-only/linux/driver.c:1279: error: ‘struct vm_area_struct’ has no member named ‘vm_offset’
/tmp/vmware-config1/vmmon-only/linux/driver.c:1286:5: warning: "LINUX_VERSION_CODE" is not defined
/tmp/vmware-config1/vmmon-only/linux/driver.c:1288: error: wrong type argument to increment
/tmp/vmware-config1/vmmon-only/linux/driver.c:1439:5: warning: "LINUX_VERSION_CODE" is not defined
/tmp/vmware-config1/vmmon-only/linux/driver.c:1683:5: warning: "LINUX_VERSION_CODE" is not defined
/tmp/vmware-config1/vmmon-only/linux/driver.c:1714:5: warning: "LINUX_VERSION_CODE" is not defined
/tmp/vmware-config1/vmmon-only/linux/driver.c: In function ‘LinuxDriver_Ioctl’:
/tmp/vmware-config1/vmmon-only/linux/driver.c:1717: error: ‘struct task_struct’ has no member named ‘dumpable’
/tmp/vmware-config1/vmmon-only/linux/driver.c:1999:5: warning: "LINUX_VERSION_CODE" is not defined
make[4]: *** [/tmp/vmware-config1/vmmon-only/linux/driver.o] Error 1
make[3]: *** [_module_/tmp/vmware-config1/vmmon-only] Error 2
make[2]: *** [modules] Error 2
make[1]: *** [modules] Error 2
make[1]: Leaving directory `/usr/src/linux-2.6.18.8-0.3-obj/x86_64/default'
make: *** [vmmon.ko] Error 2
make: Leaving directory `/tmp/vmware-config1/vmmon-only'
Unable to build the vmmon module.

For more information on how to troubleshoot module-related problems, please
visit our Web site at "http://www.vmware.com/download/modules/modules.html" and
"http://www.vmware.com/support/reference/linux/prebuilt_modules_linux.html".

Execution aborted.

linux-suse:/usr/bin # /lib/modules/2.6.18.8-0.3-default/build/include
ho già installato il kernel source e vari compilatori.
ma non riesco a acapire qual'è l'errore.

grazie pre l'aiuto!
__________________
Hp pavilion dv6-1250el [cpu: P8700 - ati radeon hd 4650 1 gb - 4 gb ram - hd 320 7200 rpm!] Garmin Official Thread
gepeppe è offline   Rispondi citando il messaggio o parte di esso
Old 17-06-2007, 09:14   #2
_YTS_
Senior Member
 
L'Avatar di _YTS_
 
Iscritto dal: Oct 2003
Città: La Spezia
Messaggi: 962
ciao
prova ad usare la patch vmware-any-any-update109:

http://ftp.cvut.cz/vmware/vmware-any...date109.tar.gz

scompattala e lancia il file runme.pl.
segui a video cosa chiede, byez
__________________

Gigabyte ga-p55-ud6 | Intel i7 860 | 2x2gb Corsair xms3 | Adaptec 2410sa | raid1 barracuda 500gb 7200.12 | Intel x25-m 80gb G2 | ATI radeon 4890 | tutto in downclock (non ho parenti all'enel)
_YTS_ è offline   Rispondi citando il messaggio o parte di esso
 Rispondi


 Recensione OPPO Find X10 Pro Max: un top di gamma completo con tre fotocamere da 200MP Recensione OPPO Find X10 Pro Max: un top di gam...
WoW Forever provato: il MMORPG che la community chiedeva da anni è arrivato WoW Forever provato: il MMORPG che la community ...
TCL P80 Ultra: con un display AMOLED opaco è una gioia per gli occhi e per le dita TCL P80 Ultra: con un display AMOLED opaco &egra...
HUAWEI MatePad Air recensione: OLED opaco e tastiera dedicata per lavorare meglio HUAWEI MatePad Air recensione: OLED opaco e tast...
NVIDIA RTX Spark: il PC Windows on ARM costruito per l'IA agentica NVIDIA RTX Spark: il PC Windows on ARM costruito...
Rowenta X-Clean 12: lavapavimenti con fu...
OPPO Enco X4 ufficiali: doppio driver Dy...
OPPO Find X10 e Find X10 Pro Max arrivan...
Recensione OPPO Enco X4: tecnologia da t...
Qualcomm, ricavi in calo e svolta verso ...
Blink Mini 4K+ e Pan-Tilt 2K+ in preordi...
Booking.com sotto indagine UE: nel mirin...
Generative Bionics apre la più gr...
Mercury 3 di Inception: 1 milione di tok...
RAM per portatili e PC all-in-one in off...
PHP, due falle critiche: patch alle 16 e...
ISRO sta proseguendo lo sviluppo della n...
Greenpeace interrompe il keynote di Jens...
YouTube sperimenta una nuova interfaccia...
WhatsApp prepara una nuova barra di navi...
Chromium
GPU-Z
OCCT
LibreOffice Portable
Opera One Portable
Opera One 106
CCleaner Portable
CCleaner Standard
Cpu-Z
Driver NVIDIA GeForce 546.65 WHQL
SmartFTP
Trillian
Google Chrome Portable
Google Chrome 120
VirtualBox
Tutti gli articoli Tutte le news Tutti i download

Strumenti

Regole
Non Puoi aprire nuove discussioni
Non Puoi rispondere ai messaggi
Non Puoi allegare file
Non Puoi modificare i tuoi messaggi

Il codice vB è On
Le Faccine sono On
Il codice [IMG] è On
Il codice HTML è Off
Vai al Forum


Tutti gli orari sono GMT +1. Ora sono le: 19:36.


Powered by vBulletin® Version 3.6.4
Copyright ©2000 - 2026, Jelsoft Enterprises Ltd.
Served by www3v