Torna indietro   Hardware Upgrade Forum > Software > Linux, Unix, OS alternativi > Linux per newbies

Nokia Innovation Day 2026: la sovranità europea passa dal mercato unico e dai laboratori italiani del gruppo
Nokia Innovation Day 2026: la sovranità europea passa dal mercato unico e dai laboratori italiani del gruppo
Politica, accademia e industria a confronto su mercato unico, sicurezza e competitività. Nei laboratori di Vimercate, Nokia ha mostrato le nuove generazioni di chip ottici e i test che ogni prodotto deve superare prima di arrivare sul mercato
In sella alla Fiido Nomads Pro: e-bike con motore centrale da 100 Nm per il divertimento a 360 gradi
In sella alla Fiido Nomads Pro: e-bike con motore centrale da 100 Nm per il divertimento a 360 gradi
Abbiamo assemblato e provato la Fiido Nomads Pro, evoluzione del modello da trekking già presente nella gamma, che migliora in tutto, soprattutto grazie al motore centrale, fluido e potente. Ottima app, costruzione solida e prezzo ok completano il quadro
Recensione Google Pixel Watch 5: sembra lo stesso, ma al polso la differenza si sente
Recensione Google Pixel Watch 5: sembra lo stesso, ma al polso la differenza si sente
Google Pixel Watch 5 ha affinato una formula già convincente con hardware più veloce, Gemini offline e nuovi strumenti per sport e benessere. Abbiamo provato la versione LTE da 41 mm, comoda anche di notte e ben proporzionata sui polsi piccoli. Il design resta un punto di forza, ma l'autonomia premia ancora il 45 mm e alcune funzioni AI non sono disponibili in Italia: ecco che cosa cambia rispetto a Watch 4 e quale formato conviene scegliere oggi
Tutti gli articoli Tutte le news

Vai al Forum
Rispondi
 
Strumenti
Old 08-05-2007, 13:55   #1
Mauro82
Senior Member
 
L'Avatar di Mauro82
 
Iscritto dal: Aug 2003
Città: Loano (Savona)
Messaggi: 1430
niubbo e fastrate usb

Ciao a tutti, sto cercando di installare il modem fastrate usb sotto debian lenny, ma non riesco a compilare il driver
quando faccio lsusb il modem viene visto, gli headers del kernel (2.6.18-4-686) sono installati con tanto ldi link simbolico, però quando do il make ottengo:
Codice:
for i in adsl_status unicorntest tools ; do make -C $i all ; done
make[1]: Entering directory `/root/unicorn/adsl_status'
make    all-recursive
make[2]: Entering directory `/root/unicorn/adsl_status'
Making all in intl
make[3]: Entering directory `/root/unicorn/adsl_status/intl'
make[3]: Nothing to be done for `all'.
make[3]: Leaving directory `/root/unicorn/adsl_status/intl'
Making all in m4
make[3]: Entering directory `/root/unicorn/adsl_status/m4'
make[3]: Nothing to be done for `all'.
make[3]: Leaving directory `/root/unicorn/adsl_status/m4'
Making all in intl
make[3]: Entering directory `/root/unicorn/adsl_status/intl'
make[3]: Nothing to be done for `all'.
make[3]: Leaving directory `/root/unicorn/adsl_status/intl'
Making all in po
make[3]: Entering directory `/root/unicorn/adsl_status/po'
make[3]: Nothing to be done for `all'.
make[3]: Leaving directory `/root/unicorn/adsl_status/po'
Making all in src
make[3]: Entering directory `/root/unicorn/adsl_status/src'
make[3]: Nothing to be done for `all'.
make[3]: Leaving directory `/root/unicorn/adsl_status/src'
make[3]: Entering directory `/root/unicorn/adsl_status'
make[3]: Leaving directory `/root/unicorn/adsl_status'
make[2]: Leaving directory `/root/unicorn/adsl_status'
make[1]: Leaving directory `/root/unicorn/adsl_status'
make[1]: Entering directory `/root/unicorn/unicorntest'
make[1]: Nothing to be done for `all'.
make[1]: Leaving directory `/root/unicorn/unicorntest'
make[1]: Entering directory `/root/unicorn/tools'
make[1]: Nothing to be done for `all'.
make[1]: Leaving directory `/root/unicorn/tools'
for i in libm unicorn_pci unicorn_usb ; do make -C $i modules MODDIR=/root/unicorn/$i ; done
make[1]: Entering directory `/root/unicorn/libm'
make[1]: Nothing to be done for `modules'.
make[1]: Leaving directory `/root/unicorn/libm'
make[1]: Entering directory `/root/unicorn/unicorn_pci'
make CC=gcc -C /usr/src/linux SUBDIRS=/root/unicorn/unicorn_pci modules
make[2]: Entering directory `/usr/src/linux-headers-2.6.18-4-686'
  CC [M]  /root/unicorn/unicorn_pci/unicorn_pcidrv.o
In file included from /root/unicorn/unicorn_pci/unicorn_pcidrv.c:25:
/root/unicorn/unicorn_pci/../amu/amas.h:373:5: warning: "WIN32" is not defined
/root/unicorn/unicorn_pci/../amu/amas.h:389:5: warning: "WIN32" is not defined
/root/unicorn/unicorn_pci/unicorn_pcidrv.c:57:5: warning: "BIG_ENDIAN" is not defined
/root/unicorn/unicorn_pci/unicorn_pcidrv.c:1781:5: warning: "NOT_USED" is not defined
/root/unicorn/unicorn_pci/unicorn_pcidrv.c:2159: error: expected ‘)’ before string constant
/root/unicorn/unicorn_pci/unicorn_pcidrv.c:2161: error: expected ‘)’ before string constant
/root/unicorn/unicorn_pci/unicorn_pcidrv.c:2162: error: expected ‘)’ before string constant
/root/unicorn/unicorn_pci/unicorn_pcidrv.c:2164: error: expected ‘)’ before string constant
/root/unicorn/unicorn_pci/unicorn_pcidrv.c:2165: error: expected ‘)’ before string constant
/root/unicorn/unicorn_pci/unicorn_pcidrv.c:2167: error: expected ‘)’ before string constant
/root/unicorn/unicorn_pci/unicorn_pcidrv.c:2169: error: expected ‘)’ before string constant
/root/unicorn/unicorn_pci/unicorn_pcidrv.c:2170: error: expected ‘)’ before string constant
/root/unicorn/unicorn_pci/unicorn_pcidrv.c:2171: error: expected ‘)’ before string constant
/root/unicorn/unicorn_pci/unicorn_pcidrv.c:2172: error: expected ‘)’ before string constant
/root/unicorn/unicorn_pci/unicorn_pcidrv.c:2173: error: expected ‘)’ before string constant
/root/unicorn/unicorn_pci/unicorn_pcidrv.c:2174: error: expected ‘)’ before string constant
/root/unicorn/unicorn_pci/unicorn_pcidrv.c:2175: error: expected ‘)’ before string constant
/root/unicorn/unicorn_pci/unicorn_pcidrv.c:2176: error: expected ‘)’ before string constant
/root/unicorn/unicorn_pci/unicorn_pcidrv.c:2177: error: expected ‘)’ before string constant
/root/unicorn/unicorn_pci/unicorn_pcidrv.c:2180: error: expected ‘)’ before string constant
/root/unicorn/unicorn_pci/unicorn_pcidrv.c:2185: error: expected ‘)’ before string constant
/root/unicorn/unicorn_pci/unicorn_pcidrv.c:2190: error: expected ‘)’ before string constant
make[3]: *** [/root/unicorn/unicorn_pci/unicorn_pcidrv.o] Error 1
make[2]: *** [_module_/root/unicorn/unicorn_pci] Error 2
make[2]: Leaving directory `/usr/src/linux-headers-2.6.18-4-686'
make[1]: *** [modules] Error 2
make[1]: Leaving directory `/root/unicorn/unicorn_pci'
make[1]: Entering directory `/root/unicorn/unicorn_usb'
make CC=gcc -C /usr/src/linux SUBDIRS=/root/unicorn/unicorn_usb modules
make[2]: Entering directory `/usr/src/linux-headers-2.6.18-4-686'
  CC [M]  /root/unicorn/unicorn_usb/unicorn_usbdrv.o
In file included from /root/unicorn/unicorn_usb/unicorn_usbdrv.c:25:
/root/unicorn/unicorn_usb/../amu/amas.h:373:5: warning: "WIN32" is not defined
/root/unicorn/unicorn_usb/../amu/amas.h:389:5: warning: "WIN32" is not defined
/root/unicorn/unicorn_usb/unicorn_usbdrv.c:2292: error: expected ‘)’ before string constant
/root/unicorn/unicorn_usb/unicorn_usbdrv.c:2294: error: expected ‘)’ before string constant
/root/unicorn/unicorn_usb/unicorn_usbdrv.c:2295: error: expected ‘)’ before string constant
/root/unicorn/unicorn_usb/unicorn_usbdrv.c:2297: error: expected ‘)’ before string constant
/root/unicorn/unicorn_usb/unicorn_usbdrv.c:2298: error: expected ‘)’ before string constant
/root/unicorn/unicorn_usb/unicorn_usbdrv.c:2299: error: expected ‘)’ before string constant
/root/unicorn/unicorn_usb/unicorn_usbdrv.c:2300: error: expected ‘)’ before string constant
/root/unicorn/unicorn_usb/unicorn_usbdrv.c:2301: error: expected ‘)’ before string constant
/root/unicorn/unicorn_usb/unicorn_usbdrv.c:2302: error: expected ‘)’ before string constant
/root/unicorn/unicorn_usb/unicorn_usbdrv.c:2303: error: expected ‘)’ before string constant
/root/unicorn/unicorn_usb/unicorn_usbdrv.c:2304: error: expected ‘)’ before string constant
/root/unicorn/unicorn_usb/unicorn_usbdrv.c:2305: error: expected ‘)’ before string constant
/root/unicorn/unicorn_usb/unicorn_usbdrv.c:2306: error: expected ‘)’ before string constant
/root/unicorn/unicorn_usb/unicorn_usbdrv.c:2307: error: expected ‘)’ before string constant
/root/unicorn/unicorn_usb/unicorn_usbdrv.c:2308: error: expected ‘)’ before string constant
/root/unicorn/unicorn_usb/unicorn_usbdrv.c:2309: error: expected ‘)’ before string constant
/root/unicorn/unicorn_usb/unicorn_usbdrv.c:2311: error: expected ‘)’ before string constant
/root/unicorn/unicorn_usb/unicorn_usbdrv.c:2313: error: expected ‘)’ before string constant
/root/unicorn/unicorn_usb/unicorn_usbdrv.c:2314: error: expected ‘)’ before string constant
/root/unicorn/unicorn_usb/unicorn_usbdrv.c:2315: error: expected ‘)’ before string constant
/root/unicorn/unicorn_usb/unicorn_usbdrv.c:2317: error: expected ‘)’ before string constant
/root/unicorn/unicorn_usb/unicorn_usbdrv.c:2318: error: expected ‘)’ before string constant
/root/unicorn/unicorn_usb/unicorn_usbdrv.c:2320: error: expected ‘)’ before string constant
/root/unicorn/unicorn_usb/unicorn_usbdrv.c:2321: error: expected ‘)’ before string constant
/root/unicorn/unicorn_usb/unicorn_usbdrv.c:2324: error: expected ‘)’ before string constant
make[3]: *** [/root/unicorn/unicorn_usb/unicorn_usbdrv.o] Error 1
make[2]: *** [_module_/root/unicorn/unicorn_usb] Error 2
make[2]: Leaving directory `/usr/src/linux-headers-2.6.18-4-686'
make[1]: *** [modules] Error 2
make[1]: Leaving directory `/root/unicorn/unicorn_usb'
make: *** [modules] Error 2
__________________
Membro Anziano dell'HWU Automotive Team Auto Storiche Group Alfa Romeo 33 stradale 1967
Intel Core i7 2600K -Asus P8P67 EVO - 16Gb G.Skill - Radeon 6850 - SSD Samsung 840 Pro
PC2 Thinkpad T410 - PC3 Athlon64 x2 [email protected] DFI Lanparty NF4 UltraD TG DDR600 7600GT Raptor74
Mauro82 è offline   Rispondi citando il messaggio o parte di esso
Old 09-05-2007, 16:14   #2
Mauro82
Senior Member
 
L'Avatar di Mauro82
 
Iscritto dal: Aug 2003
Città: Loano (Savona)
Messaggi: 1430
sono riuscito a compilare i driver, però adesso ltutte le luci rimangono accese contemporaneamente

inoltre se lo lascio attaccato il boot si ferma
__________________
Membro Anziano dell'HWU Automotive Team Auto Storiche Group Alfa Romeo 33 stradale 1967
Intel Core i7 2600K -Asus P8P67 EVO - 16Gb G.Skill - Radeon 6850 - SSD Samsung 840 Pro
PC2 Thinkpad T410 - PC3 Athlon64 x2 [email protected] DFI Lanparty NF4 UltraD TG DDR600 7600GT Raptor74

Ultima modifica di Mauro82 : 09-05-2007 alle 20:03.
Mauro82 è offline   Rispondi citando il messaggio o parte di esso
 Rispondi


Nokia Innovation Day 2026: la sovranità europea passa dal mercato unico e dai laboratori italiani del gruppo Nokia Innovation Day 2026: la sovranità e...
In sella alla Fiido Nomads Pro: e-bike con motore centrale da 100 Nm per il divertimento a 360 gradi In sella alla Fiido Nomads Pro: e-bike con motor...
Recensione Google Pixel Watch 5: sembra lo stesso, ma al polso la differenza si sente Recensione Google Pixel Watch 5: sembra lo stess...
ASUS Zenbook 14 (UX3480AA): tanta autonomia con uno chassis bello e robusto ASUS Zenbook 14 (UX3480AA): tanta autonomia con ...
MSI PRO MAX: QD-OLED ultrawide per lavorare, creare e giocare MSI PRO MAX: QD-OLED ultrawide per lavorare, cre...
Ray-Ban Meta Audio: arrivano gli occhial...
Apple TV 4K: chip A19, CPU più veloce de...
Il mercato console sprofonda: i rincari ...
Apple Home Collection: videocamere 2,5K,...
Apple presenta HomeView, il nuovo hub do...
Apple HomePod mini 2 arriva in Italia: a...
SFSCON 2026: la sovranità digital...
Cooler Master GPU Shield arriva in Europ...
Wolters Kluwer Tax & Accounting pote...
NVIDIA accelera il DLSS 5: il nuovo mode...
Character.ai in bancarotta, Disney pront...
realme passa a ColorOS 17 con Android 17...
OPPO presenta ColorOS 17: più flu...
Giochi PS2 su smartphone Android: ARMSX2...
Ecco il nuovo tool semplificato per alle...
Chromium
GPU-Z
OCCT
LibreOffice Portable
Opera One Portable
Opera One 106
CCleaner Portable
CCleaner Standard
Cpu-Z
Driver NVIDIA GeForce 546.65 WHQL
SmartFTP
Trillian
Google Chrome Portable
Google Chrome 120
VirtualBox
Tutti gli articoli Tutte le news Tutti i download

Strumenti

Regole
Non Puoi aprire nuove discussioni
Non Puoi rispondere ai messaggi
Non Puoi allegare file
Non Puoi modificare i tuoi messaggi

Il codice vB è On
Le Faccine sono On
Il codice [IMG] è On
Il codice HTML è Off
Vai al Forum


Tutti gli orari sono GMT +1. Ora sono le: 18:46.


Powered by vBulletin® Version 3.6.4
Copyright ©2000 - 2026, Jelsoft Enterprises Ltd.
Served by www3v