Torna indietro   Hardware Upgrade Forum > Software > Linux, Unix, OS alternativi

 Recensione OPPO Find X10 Pro Max: un top di gamma completo con tre fotocamere da 200MP
Recensione OPPO Find X10 Pro Max: un top di gamma completo con tre fotocamere da 200MP
OPPO ha appena lanciato sul mercato la nuova serie Find X10, che ha come smartphone premium il Find X10 Pro Max, uno smartphone completo, che fa del comparto fotografico il suo vero punto di forza. Ma sono tante le novità, tra cui l'AI che adesso diventa agentica. Ma andiamo a vedere nel dettaglio questo nuovo smartphone.
WoW Forever provato: il MMORPG che la community chiedeva da anni è arrivato
WoW Forever provato: il MMORPG che la community chiedeva da anni è arrivato
Abbiamo provato la beta di World of Warcraft: Forever, il Classic+ di Blizzard in arrivo il 4 novembre: la nuova razza Skyborne restituisce la sensazione di un gioco nuovo, ma le zone storiche conservano la noia divertita di Classic. Classi ribilanciate, sciamani anche nell'Alleanza e un motore grafico che in 4K gira bene anche su una RTX 3070. Cosa cambia in Forever? La risposta nell'articolo
TCL P80 Ultra: con un display AMOLED opaco è una gioia per gli occhi e per le dita
TCL P80 Ultra: con un display AMOLED opaco è una gioia per gli occhi e per le dita
TCL P80 Ultra abbina per la prima volta un pannello AMOLED alla tecnologia NXTPAPER con finitura opaca, affiancandoci una fotocamera periscopica da 50 MP con zoom ottico 3x, il SoC Dimensity 7400 Elite e una batteria da 5.800 mAh. Nella prova sul campo emergono luminosità di picco molto elevata, comparto fotografico solido per la fascia di prezzo e autonomia nella media, a fronte di velocità di scrittura dello storage piuttosto contenute
Tutti gli articoli Tutte le news

Vai al Forum
Rispondi
 
Strumenti
Old 31-10-2006, 15:47   #1
Berno
Senior Member
 
L'Avatar di Berno
 
Iscritto dal: Mar 2000
Città: Ferrara
Messaggi: 2002
[kubuntu] Ricompilare kernel

Come faccio a ricompialre il kernel sulla kubuntu?

Io ho installato (da adept):

- gcc 3.4.6
- gcc 4.0.3
- linux-source-2.6.15

E mi sono ritrovato in /usr/src/ il pacchetto con i sorgenti del kernel ancora da scompattare (strano, pensavo che adept facesse tutto da solo), io li ho scompattati in una cartella che ho chiamato "linux-source-2.6.15" ed ho pure creato in /usr/src il link a questa cartella chiamandolo "linux" (così c'è scritto sulle guide)...

Quando entro nella cartella dei sorgenti e dò uno qualsiasi dei comandi:

- make config
- make menuconfig
- make xconfig

Mi saltano fuori una caterva di errori di compilazione del tipo (per make config):

Codice:
   HOSTCC  scripts/basic/fixdep
scripts/basic/fixdep.c:105:23: error: sys/types.h: Nessun file o directory
scripts/basic/fixdep.c:106:22: error: sys/stat.h: Nessun file o directory
scripts/basic/fixdep.c:107:22: error: sys/mman.h: Nessun file o directory
scripts/basic/fixdep.c:108:20: error: unistd.h: Nessun file o directory
scripts/basic/fixdep.c:109:19: error: fcntl.h: Nessun file o directory
scripts/basic/fixdep.c:110:20: error: string.h: Nessun file o directory
scripts/basic/fixdep.c:111:20: error: stdlib.h: Nessun file o directory
scripts/basic/fixdep.c:112:19: error: stdio.h: Nessun file o directory
In file included from /usr/lib/gcc/i486-linux-gnu/4.0.3/include/syslimits.h:7,
                 from /usr/lib/gcc/i486-linux-gnu/4.0.3/include/limits.h:11,
                 from scripts/basic/fixdep.c:113:
/usr/lib/gcc/i486-linux-gnu/4.0.3/include/limits.h:122:61: error: limits.h: Nessun file o directory
scripts/basic/fixdep.c:114:19: error: ctype.h: Nessun file o directory
scripts/basic/fixdep.c:115:23: error: arpa/inet.h: Nessun file o directory
scripts/basic/fixdep.c: In function ‘usage’:
scripts/basic/fixdep.c:129: warning: implicit declaration of function ‘fprintf’
scripts/basic/fixdep.c:129: warning: incompatible implicit declaration of built-in function ‘fprintf’
scripts/basic/fixdep.c:129: error: ‘stderr’ undeclared (first use in this function)
scripts/basic/fixdep.c:129: error: (Each undeclared identifier is reported only once
scripts/basic/fixdep.c:129: error: for each function it appears in.)
scripts/basic/fixdep.c:130: warning: implicit declaration of function ‘exit’
scripts/basic/fixdep.c:130: warning: incompatible implicit declaration of built-in function ‘exit’
scripts/basic/fixdep.c: In function ‘print_cmdline’:
scripts/basic/fixdep.c:135: warning: implicit declaration of function ‘printf’
scripts/basic/fixdep.c:135: warning: incompatible implicit declaration of built-in function ‘printf’
scripts/basic/fixdep.c: At top level:
scripts/basic/fixdep.c:138: error: ‘NULL’ undeclared here (not in a function)
scripts/basic/fixdep.c: In function ‘grow_config’:
scripts/basic/fixdep.c:151: warning: implicit declaration of function ‘realloc’
scripts/basic/fixdep.c:151: warning: assignment makes pointer from integer without a cast
scripts/basic/fixdep.c:153: warning: implicit declaration of function ‘perror’
scripts/basic/fixdep.c:153: warning: incompatible implicit declaration of built-in function ‘exit’
scripts/basic/fixdep.c: In function ‘is_defined_config’:
scripts/basic/fixdep.c:169: warning: implicit declaration of function ‘memcmp’
scripts/basic/fixdep.c: In function ‘define_config’:
scripts/basic/fixdep.c:182: warning: implicit declaration of function ‘memcpy’
scripts/basic/fixdep.c:182: warning: incompatible implicit declaration of built-in function ‘memcpy’
scripts/basic/fixdep.c: In function ‘use_config’:
scripts/basic/fixdep.c:201: error: ‘PATH_MAX’ undeclared (first use in this function)
scripts/basic/fixdep.c:209: warning: incompatible implicit declaration of built-in function ‘memcpy’
scripts/basic/fixdep.c:215: warning: implicit declaration of function ‘tolower’
scripts/basic/fixdep.c:217: warning: incompatible implicit declaration of built-in function ‘printf’
scripts/basic/fixdep.c:201: warning: unused variable ‘s’
scripts/basic/fixdep.c: At top level:
scripts/basic/fixdep.c:220: error: syntax error before ‘size_t’
scripts/basic/fixdep.c:221: warning: function declaration isn’t a prototype
scripts/basic/fixdep.c: In function ‘parse_config_file’:
scripts/basic/fixdep.c:222: error: ‘map’ undeclared (first use in this function)
scripts/basic/fixdep.c:222: error: ‘len’ undeclared (first use in this function)
scripts/basic/fixdep.c:228: warning: implicit declaration of function ‘ntohl’
scripts/basic/fixdep.c:239: warning: implicit declaration of function ‘isalnum’
scripts/basic/fixdep.c: In function ‘strrcmp’:
scripts/basic/fixdep.c:252: warning: implicit declaration of function ‘strlen’
scripts/basic/fixdep.c:252: warning: incompatible implicit declaration of built-in function ‘strlen’
scripts/basic/fixdep.c: In function ‘do_config_file’:
scripts/basic/fixdep.c:263: error: storage size of ‘st’ isn’t known
scripts/basic/fixdep.c:267: warning: implicit declaration of function ‘open’
scripts/basic/fixdep.c:267: error: ‘O_RDONLY’ undeclared (first use in this function)
scripts/basic/fixdep.c:269: warning: incompatible implicit declaration of built-in function ‘fprintf’
scripts/basic/fixdep.c:269: error: ‘stderr’ undeclared (first use in this function)
scripts/basic/fixdep.c:271: warning: incompatible implicit declaration of built-in function ‘exit’
scripts/basic/fixdep.c:273: warning: implicit declaration of function ‘fstat’
scripts/basic/fixdep.c:275: warning: implicit declaration of function ‘close’
scripts/basic/fixdep.c:278: warning: implicit declaration of function ‘mmap’
scripts/basic/fixdep.c:278: error: ‘PROT_READ’ undeclared (first use in this function)
scripts/basic/fixdep.c:278: error: ‘MAP_PRIVATE’ undeclared (first use in this function)
scripts/basic/fixdep.c:278: warning: assignment makes pointer from integer without a cast
scripts/basic/fixdep.c:287: warning: implicit declaration of function ‘munmap’
scripts/basic/fixdep.c:263: warning: unused variable ‘st’
scripts/basic/fixdep.c: At top level:
scripts/basic/fixdep.c:292: error: syntax error before ‘size_t’
scripts/basic/fixdep.c:293: warning: function declaration isn’t a prototype
scripts/basic/fixdep.c: In function ‘parse_dep_file’:
scripts/basic/fixdep.c:294: error: ‘map’ undeclared (first use in this function)
scripts/basic/fixdep.c:295: error: ‘len’ undeclared (first use in this function)
scripts/basic/fixdep.c:297: error: ‘PATH_MAX’ undeclared (first use in this function)
scripts/basic/fixdep.c:299: warning: implicit declaration of function ‘strchr’
scripts/basic/fixdep.c:299: warning: incompatible implicit declaration of built-in function ‘strchr’
scripts/basic/fixdep.c:301: warning: incompatible implicit declaration of built-in function ‘fprintf’
scripts/basic/fixdep.c:301: error: ‘stderr’ undeclared (first use in this function)
scripts/basic/fixdep.c:302: warning: incompatible implicit declaration of built-in function ‘exit’
scripts/basic/fixdep.c:304: warning: incompatible implicit declaration of built-in function ‘memcpy’
scripts/basic/fixdep.c:305: warning: incompatible implicit declaration of built-in function ‘printf’
scripts/basic/fixdep.c:297: warning: unused variable ‘s’
scripts/basic/fixdep.c: In function ‘print_deps’:
scripts/basic/fixdep.c:334: error: storage size of ‘st’ isn’t known
scripts/basic/fixdep.c:338: error: ‘O_RDONLY’ undeclared (first use in this function)
scripts/basic/fixdep.c:340: warning: incompatible implicit declaration of built-in function ‘fprintf’
scripts/basic/fixdep.c:340: error: ‘stderr’ undeclared (first use in this function)
scripts/basic/fixdep.c:342: warning: incompatible implicit declaration of built-in function ‘exit’
scripts/basic/fixdep.c:346: warning: incompatible implicit declaration of built-in function ‘fprintf’
scripts/basic/fixdep.c:350: error: ‘PROT_READ’ undeclared (first use in this function)
scripts/basic/fixdep.c:350: error: ‘MAP_PRIVATE’ undeclared (first use in this function)
scripts/basic/fixdep.c:350: warning: assignment makes pointer from integer without a cast
scripts/basic/fixdep.c:334: warning: unused variable ‘st’
scripts/basic/fixdep.c: In function ‘traps’:
scripts/basic/fixdep.c:369: warning: incompatible implicit declaration of built-in function ‘fprintf’
scripts/basic/fixdep.c:369: error: ‘stderr’ undeclared (first use in this function)
scripts/basic/fixdep.c:371: warning: incompatible implicit declaration of built-in function ‘exit’
scripts/basic/fixdep.c: At top level:
scripts/basic/fixdep.c:390: fatal error: opening dependency file scripts/basic/.fixdep.d: Permesso negato
compilation terminated.
make[1]: *** [scripts/basic/fixdep] Error 1
make: *** [scripts_basic] Error 2
Dove sto sbagliando???
__________________
Ryzen 5 5600X, 32GB DDR4-3000MHz, Asrock B550M-Pro4, Case Fractal Design Dfine Mini, SSD Samsung 980Pro 500GB
Berno è offline   Rispondi citando il messaggio o parte di esso
Old 01-11-2006, 14:40   #2
Berno
Senior Member
 
L'Avatar di Berno
 
Iscritto dal: Mar 2000
Città: Ferrara
Messaggi: 2002
Up ...
__________________
Ryzen 5 5600X, 32GB DDR4-3000MHz, Asrock B550M-Pro4, Case Fractal Design Dfine Mini, SSD Samsung 980Pro 500GB
Berno è offline   Rispondi citando il messaggio o parte di esso
 Rispondi


 Recensione OPPO Find X10 Pro Max: un top di gamma completo con tre fotocamere da 200MP Recensione OPPO Find X10 Pro Max: un top di gam...
WoW Forever provato: il MMORPG che la community chiedeva da anni è arrivato WoW Forever provato: il MMORPG che la community ...
TCL P80 Ultra: con un display AMOLED opaco è una gioia per gli occhi e per le dita TCL P80 Ultra: con un display AMOLED opaco &egra...
HUAWEI MatePad Air recensione: OLED opaco e tastiera dedicata per lavorare meglio HUAWEI MatePad Air recensione: OLED opaco e tast...
NVIDIA RTX Spark: il PC Windows on ARM costruito per l'IA agentica NVIDIA RTX Spark: il PC Windows on ARM costruito...
Rowenta X-Clean 12: lavapavimenti con fu...
OPPO Enco X4 ufficiali: doppio driver Dy...
OPPO Find X10 e Find X10 Pro Max arrivan...
Recensione OPPO Enco X4: tecnologia da t...
Qualcomm, ricavi in calo e svolta verso ...
Blink Mini 4K+ e Pan-Tilt 2K+ in preordi...
Booking.com sotto indagine UE: nel mirin...
Generative Bionics apre la più gr...
Mercury 3 di Inception: 1 milione di tok...
RAM per portatili e PC all-in-one in off...
PHP, due falle critiche: patch alle 16 e...
ISRO sta proseguendo lo sviluppo della n...
Greenpeace interrompe il keynote di Jens...
YouTube sperimenta una nuova interfaccia...
WhatsApp prepara una nuova barra di navi...
Chromium
GPU-Z
OCCT
LibreOffice Portable
Opera One Portable
Opera One 106
CCleaner Portable
CCleaner Standard
Cpu-Z
Driver NVIDIA GeForce 546.65 WHQL
SmartFTP
Trillian
Google Chrome Portable
Google Chrome 120
VirtualBox
Tutti gli articoli Tutte le news Tutti i download

Strumenti

Regole
Non Puoi aprire nuove discussioni
Non Puoi rispondere ai messaggi
Non Puoi allegare file
Non Puoi modificare i tuoi messaggi

Il codice vB è On
Le Faccine sono On
Il codice [IMG] è On
Il codice HTML è Off
Vai al Forum


Tutti gli orari sono GMT +1. Ora sono le: 16:47.


Powered by vBulletin® Version 3.6.4
Copyright ©2000 - 2026, Jelsoft Enterprises Ltd.
Served by www3v