Torna indietro   Hardware Upgrade Forum > Software > Linux, Unix, OS alternativi > Linux per newbies

Samsung Micro RGB R95H, il primo LCD a LED rossi, verdi e blu di Samsung alla prova del banco di misura
Samsung Micro RGB R95H, il primo LCD a LED rossi, verdi e blu di Samsung alla prova del banco di misura
Il primo Micro RGB di Samsung per il salotto è il 65 pollici da 2.749 euro. Sul banco di misura abbiamo rilevato 2.000 nit di picco, nero assoluto con il local dimming e il 91,4% del BT.2020, il colore più ampio che abbiamo misurato su un LCD
iPhone 18 Pro: la recensione del miglior iPhone compatto di sempre
iPhone 18 Pro: la recensione del miglior iPhone compatto di sempre
Apple ha rinnovato iPhone 18 Pro soprattutto dentro: chip A20 Pro a 2 nm con memoria affiancata al SoC, camera di vapore tre volte più ampia, Dynamic Island più piccola del 25% grazie a Face ID sotto il display e fotocamera principale con diaframma variabile da f/1.48 a f/4. Lo abbiamo misurato al colorimetro e nei benchmark, usato con iOS 27 e messo alla prova in fotografia tra laghi, borghi e interni poco illuminati
Panasonic, 30 anni di Toughbook: la "Bibbia" di mille regole dietro i nuovi G3 e 34
Panasonic, 30 anni di Toughbook: la "Bibbia" di mille regole dietro i nuovi G3 e 34
A Londra, per il trentennale dei Toughbook, Panasonic ha presentato il tablet G3 e il 2-in-1 34. Con Jon Tucker, a capo dell'ingegneria europea, abbiamo parlato di ciò che non si vede: batterie, antenne, porte seriali e accorgimenti nati sul campo
Tutti gli articoli Tutte le news

Vai al Forum
Rispondi
 
Strumenti
Old 29-09-2006, 18:39   #1
ciottano
Senior Member
 
L'Avatar di ciottano
 
Iscritto dal: Apr 2003
Messaggi: 6479
Errore nella compilazione di un driver

Sto tentando di installare una penna usb per il wi-fi e devo compilare il driver. quando lancio il make mi da questo errore:
Codice:
make
/lib/modules/2.6.15-1.2054_FC5/build
/home/Giordano/Desktop/zd1211-4916/zdsta
-I/home/Giordano/Desktop/zd1211-4916/zdsta/src/include -fomit-frame-pointer -O2 -Wall -Wstrict-prototypes -pipe -DHOST_IF_USB -DAMAC -DGCCK -DOFDM -DUSE_EP4_SET_REG -DDOWNLOADFIRMWARE -DfTX_GAIN_OFDM=0 -DfNEW_CODE_MAP=1 -DfWRITE_WORD_REG=1 -DfREAD_MUL_REG=1 -DENHANCE_RX=1
make -C /lib/modules/2.6.15-1.2054_FC5/build SUBDIRS=/home/Giordano/Desktop/zd1211-4916/zdsta modules
make: *** /lib/modules/2.6.15-1.2054_FC5/build: No such file or directory.  Stop.
make: *** [all] Error 2
se non ho capito male cerca la directory in cui ci sono i sorgenti del kernel...forse io li ho da un'altra parte ma non so dove...come posso ovviare?
__________________
Roma: affitto stanza ammobiliata a ragazzo/a lavoratore/ice e/o studente/ssa adiacente metro. Mandatemi un pvt o mail
Sono Dott. in Fisica: offro lezioni in matematica e fisica a ragazzi dalle elementari fino all'università a Roma Nord, prezzi modici
Utente da evitare: fabyor
ciottano è offline   Rispondi citando il messaggio o parte di esso
Old 29-09-2006, 18:59   #2
ciottano
Senior Member
 
L'Avatar di ciottano
 
Iscritto dal: Apr 2003
Messaggi: 6479
Codice:
/lib/modules/2.6.15-1.2054_FC5/build
/home/Giordano/Desktop/zd1211-4916/zdsta
-I/home/Giordano/Desktop/zd1211-4916/zdsta/src/include -fomit-frame-pointer -O2 -Wall -Wstrict-prototypes -pipe -DHOST_IF_USB -DAMAC -DGCCK -DOFDM -DUSE_EP4_SET_REG -DDOWNLOADFIRMWARE -DfTX_GAIN_OFDM=0 -DfNEW_CODE_MAP=1 -DfWRITE_WORD_REG=1 -DfREAD_MUL_REG=1 -DENHANCE_RX=1
make -C /lib/modules/2.6.15-1.2054_FC5/build SUBDIRS=/home/Giordano/Desktop/zd1211-4916/zdsta modules
make[1]: Entering directory `/usr/src/kernels/2.6.15-1.2054_FC5-i686'
  CC [M]  /home/Giordano/Desktop/zd1211-4916/zdsta/src/zd1205.o
In file included from /home/Giordano/Desktop/zd1211-4916/zdsta/src/zd1205.c:42:
/home/Giordano/Desktop/zd1211-4916/zdsta/src/zd1205.h:675: warning: ‘__packed__’ attribute ignored
/home/Giordano/Desktop/zd1211-4916/zdsta/src/zd1205.c: In function ‘zd1205_house_keeping’:
/home/Giordano/Desktop/zd1211-4916/zdsta/src/zd1205.c:1197: warning: unused variable ‘tmpvalue’
/home/Giordano/Desktop/zd1211-4916/zdsta/src/zd1205.c: In function ‘zd1205_transmit_cleanup’:
/home/Giordano/Desktop/zd1211-4916/zdsta/src/zd1205.c:1664: warning: unused variable ‘i’
/home/Giordano/Desktop/zd1211-4916/zdsta/src/zd1205.c: In function ‘zd1205_tx_isr’:
/home/Giordano/Desktop/zd1211-4916/zdsta/src/zd1205.c:1715: warning: unused variable ‘next_sw_tcb’
/home/Giordano/Desktop/zd1211-4916/zdsta/src/zd1205.c: In function ‘zd1205_start_ru’:
/home/Giordano/Desktop/zd1211-4916/zdsta/src/zd1205.c:2750: warning: unused variable ‘loopCnt’
/home/Giordano/Desktop/zd1211-4916/zdsta/src/zd1205.c:2742: warning: unused variable ‘tmp_value’
/home/Giordano/Desktop/zd1211-4916/zdsta/src/zd1205.c: In function ‘zd1205_recycle_rx’:
/home/Giordano/Desktop/zd1211-4916/zdsta/src/zd1205.c:2845: warning: unused variable ‘buffer_found’
/home/Giordano/Desktop/zd1211-4916/zdsta/src/zd1205.c:2841: warning: unused variable ‘tmp_value’
/home/Giordano/Desktop/zd1211-4916/zdsta/src/zd1205.c: In function ‘zd1205_rx_isr’:
/home/Giordano/Desktop/zd1211-4916/zdsta/src/zd1205.c:3140: warning: ISO C90 forbids mixed declarations and code
/home/Giordano/Desktop/zd1211-4916/zdsta/src/zd1205.c: In function ‘zd1205_sleep_reset’:
/home/Giordano/Desktop/zd1211-4916/zdsta/src/zd1205.c:4567: warning: unused variable ‘flags’
/home/Giordano/Desktop/zd1211-4916/zdsta/src/zd1205.c: In function ‘zd1205_process_wakeup’:
/home/Giordano/Desktop/zd1211-4916/zdsta/src/zd1205.c:4733: warning: unused variable ‘tmpvalue’
/home/Giordano/Desktop/zd1211-4916/zdsta/src/zd1205.c:4732: warning: unused variable ‘TSFTimer’
/home/Giordano/Desktop/zd1211-4916/zdsta/src/zd1205.c: In function ‘zd1205_watchdog’:
/home/Giordano/Desktop/zd1211-4916/zdsta/src/zd1205.c:5187: error: label at end of compound statement
/home/Giordano/Desktop/zd1211-4916/zdsta/src/zd1205.c:5022: warning: unused variable ‘tmpvalue’
/home/Giordano/Desktop/zd1211-4916/zdsta/src/zd1205.c:5019: warning: unused variable ‘diffTime’
/home/Giordano/Desktop/zd1211-4916/zdsta/src/zd1205.c:5018: warning: unused variable ‘i’
/home/Giordano/Desktop/zd1211-4916/zdsta/src/zd1205.c: In function ‘zd1205wext_siwscan’:
/home/Giordano/Desktop/zd1211-4916/zdsta/src/zd1205.c:6401: warning: unused variable ‘macp’
/home/Giordano/Desktop/zd1211-4916/zdsta/src/zd1205.c: In function ‘zd1205_translate_scan’:
/home/Giordano/Desktop/zd1211-4916/zdsta/src/zd1205.c:6426: warning: unused variable ‘macp’
/home/Giordano/Desktop/zd1211-4916/zdsta/src/zd1205.c: In function ‘zd1205_ioctl’:
/home/Giordano/Desktop/zd1211-4916/zdsta/src/zd1205.c:6703: warning: ISO C90 forbids mixed declarations and code
/home/Giordano/Desktop/zd1211-4916/zdsta/src/zd1205.c:6730: warning: ISO C90 forbids mixed declarations and code
/home/Giordano/Desktop/zd1211-4916/zdsta/src/zd1205.c:6907: warning: implicit declaration of function ‘verify_area’
/home/Giordano/Desktop/zd1211-4916/zdsta/src/zd1205.c: In function ‘zd1205_load_card_setting’:
/home/Giordano/Desktop/zd1211-4916/zdsta/src/zd1205.c:7428: warning: implicit declaration of function ‘open’
/home/Giordano/Desktop/zd1211-4916/zdsta/src/zd1205.c:7448: warning: implicit declaration of function ‘read’
/home/Giordano/Desktop/zd1211-4916/zdsta/src/zd1205.c:7452: warning: implicit declaration of function ‘close’
/home/Giordano/Desktop/zd1211-4916/zdsta/src/zd1205.c:7458: warning: suggest parentheses around assignment used as truth value
/home/Giordano/Desktop/zd1211-4916/zdsta/src/zd1205.c:7414: warning: unused variable ‘j’
/home/Giordano/Desktop/zd1211-4916/zdsta/src/zd1205.c:7411: warning: unused variable ‘file_info’
/home/Giordano/Desktop/zd1211-4916/zdsta/src/zd1205.c: In function ‘zd1205_save_card_setting’:
/home/Giordano/Desktop/zd1211-4916/zdsta/src/zd1205.c:7609: warning: implicit declaration of function ‘write’
/home/Giordano/Desktop/zd1211-4916/zdsta/src/zd1205.c:7539: warning: unused variable ‘i’
/home/Giordano/Desktop/zd1211-4916/zdsta/src/zd1205.c:7536: warning: unused variable ‘file_info’
/home/Giordano/Desktop/zd1211-4916/zdsta/src/zd1205.c: In function ‘zd1205_clear_structs’:
/home/Giordano/Desktop/zd1211-4916/zdsta/src/zd1205.c:7784: warning: unused variable ‘macp’
/home/Giordano/Desktop/zd1211-4916/zdsta/src/zd1205.c: In function ‘zdcb_setup_next_send’:
/home/Giordano/Desktop/zd1211-4916/zdsta/src/zd1205.c:7918: warning: unused variable ‘loopCnt’
/home/Giordano/Desktop/zd1211-4916/zdsta/src/zd1205.c:7916: warning: unused variable ‘lock_flag’
/home/Giordano/Desktop/zd1211-4916/zdsta/src/zd1205.c:7904: warning: unused variable ‘tmp_value3’
/home/Giordano/Desktop/zd1211-4916/zdsta/src/zd1205.c:7904: warning: unused variable ‘tmp_value’
/home/Giordano/Desktop/zd1211-4916/zdsta/src/zd1205.c:7898: warning: unused variable ‘next_sw_tcb’
/home/Giordano/Desktop/zd1211-4916/zdsta/src/zd1205.c: In function ‘CalculateQuality’:
/home/Giordano/Desktop/zd1211-4916/zdsta/src/zd1205.c:9030: warning: ISO C90 forbids mixed declarations and code
make[2]: *** [/home/Giordano/Desktop/zd1211-4916/zdsta/src/zd1205.o] Error 1
make[1]: *** [_module_/home/Giordano/Desktop/zd1211-4916/zdsta] Error 2
make[1]: Leaving directory `/usr/src/kernels/2.6.15-1.2054_FC5-i686'
make: *** [all] Error 2
Ho installato il pacchetto kernel-devel per la mia versione di kernel e rilanciando il comando ora mi da questa'altra serie di errori.
__________________
Roma: affitto stanza ammobiliata a ragazzo/a lavoratore/ice e/o studente/ssa adiacente metro. Mandatemi un pvt o mail
Sono Dott. in Fisica: offro lezioni in matematica e fisica a ragazzi dalle elementari fino all'università a Roma Nord, prezzi modici
Utente da evitare: fabyor
ciottano è offline   Rispondi citando il messaggio o parte di esso
Old 29-09-2006, 19:08   #3
-Slash
Senior Member
 
L'Avatar di -Slash
 
Iscritto dal: Mar 2006
Messaggi: 2516
hai installato gli headers del kernel?

per l'installazione di nuovi moduli sono necessari
-Slash è offline   Rispondi citando il messaggio o parte di esso
 Rispondi


Samsung Micro RGB R95H, il primo LCD a LED rossi, verdi e blu di Samsung alla prova del banco di misura Samsung Micro RGB R95H, il primo LCD a LED rossi...
iPhone 18 Pro: la recensione del miglior iPhone compatto di sempre iPhone 18 Pro: la recensione del miglior iPhone ...
Panasonic, 30 anni di Toughbook: la "Bibbia" di mille regole dietro i nuovi G3 e 34 Panasonic, 30 anni di Toughbook: la "Bibbia...
realme C100x, lo smartphone economico con la batteria da 7500 mAh. La recensione realme C100x, lo smartphone economico con la bat...
Star Wars Zero Company è l'erede di XCOM 2 Star Wars Zero Company è l'erede di XCOM ...
Ricarica wireless dinamica fino a 150 kW...
Troppi report invalidi generati dall'IA:...
Furto di identità su scala nazion...
HPE vende i primi sistemi AMD Helios per...
Suno AI nel mirino dell'Antitrust: conte...
Xiaomi avrebbe cancellato il suo prossim...
WINDTRE BUSINESS rinnova l’offerta mobil...
BMW inaugura la fabbrica di batterie da ...
Googlebook apre al modding: bootloader s...
Denuvo non molla, vuole scoprire chi &eg...
Il miglior portatile tuttofare a basso p...
Gli agenti di OpenAI hanno mandato in ti...
Follie Amazon Prime: Zenbook è un...
MicroSD SanDisk in offerta Prime Day: Ul...
Steve Jobs, 15 anni dopo: John Ternus e ...
Chromium
GPU-Z
OCCT
LibreOffice Portable
Opera One Portable
Opera One 106
CCleaner Portable
CCleaner Standard
Cpu-Z
Driver NVIDIA GeForce 546.65 WHQL
SmartFTP
Trillian
Google Chrome Portable
Google Chrome 120
VirtualBox
Tutti gli articoli Tutte le news Tutti i download

Strumenti

Regole
Non Puoi aprire nuove discussioni
Non Puoi rispondere ai messaggi
Non Puoi allegare file
Non Puoi modificare i tuoi messaggi

Il codice vB è On
Le Faccine sono On
Il codice [IMG] è On
Il codice HTML è Off
Vai al Forum


Tutti gli orari sono GMT +1. Ora sono le: 18:16.


Powered by vBulletin® Version 3.6.4
Copyright ©2000 - 2026, Jelsoft Enterprises Ltd.
Served by www3v